Build: #5 failed Changes by Gary Kramlich

Logs

The following logs have been generated by the jobs in this plan.
  • Expand all
  • Collapse all
Job Logs
Collapse debian buster amd64 distros Download or View
15-Dec-2018 09:14:08 2018-12-15 04:14:08.449 debian-buster-amd64/stage-0/build:         chown 0:0 -- debian/.debhelper/libgplugin-lua/dbgsym-root/DEBIAN/md5sums
15-Dec-2018 09:14:08 2018-12-15 04:14:08.450 debian-buster-amd64/stage-0/build:         chmod 0644 -- debian/.debhelper/libgplugin-python/dbgsym-root/DEBIAN/md5sums
15-Dec-2018 09:14:08 2018-12-15 04:14:08.450 debian-buster-amd64/stage-0/build:         chown 0:0 -- debian/.debhelper/libgplugin-python/dbgsym-root/DEBIAN/md5sums
15-Dec-2018 09:14:08 2018-12-15 04:14:08.453 debian-buster-amd64/stage-0/build:    debian/rules override_dh_builddeb
15-Dec-2018 09:14:08 2018-12-15 04:14:08.458 debian-buster-amd64/stage-0/build: make[1]: Entering directory '/workspace'
15-Dec-2018 09:14:08 2018-12-15 04:14:08.458 debian-buster-amd64/stage-0/build: # copy the dsc and the tar file to the uploads dir
15-Dec-2018 09:14:08 2018-12-15 04:14:08.460 debian-buster-amd64/stage-0/build: cp ../gplugin_*.dsc ../gplugin_*.tar.* ../gplugin_*.changes ..
15-Dec-2018 09:14:08 2018-12-15 04:14:08.463 debian-buster-amd64/stage-0/build: cp: '../gplugin_0.27.5~5d832d3f9ff9.dsc' and '../gplugin_0.27.5~5d832d3f9ff9.dsc' are the same file
15-Dec-2018 09:14:08 2018-12-15 04:14:08.463 debian-buster-amd64/stage-0/build: cp: '../gplugin_0.27.5~5d832d3f9ff9.tar.xz' and '../gplugin_0.27.5~5d832d3f9ff9.tar.xz' are the same file
15-Dec-2018 09:14:08 2018-12-15 04:14:08.463 debian-buster-amd64/stage-0/build: cp: cannot stat '../gplugin_*.changes': No such file or directory
15-Dec-2018 09:14:08 2018-12-15 04:14:08.463 debian-buster-amd64/stage-0/build: make[1]: *** [debian/rules:31: override_dh_builddeb] Error 1
15-Dec-2018 09:14:08 2018-12-15 04:14:08.463 debian-buster-amd64/stage-0/build: make[1]: Leaving directory '/workspace'
15-Dec-2018 09:14:08 2018-12-15 04:14:08.471 debian-buster-amd64/stage-0/build: make: *** [debian/rules:11: binary] Error 2
15-Dec-2018 09:14:08 2018-12-15 04:14:08.472 debian-buster-amd64/stage-0/build: dpkg-buildpackage: error: debian/rules binary subprocess returned exit status 2
15-Dec-2018 09:14:08 2018-12-15 04:14:08.482 debian-buster-amd64/stage-0/build: debuild: fatal error at line 1182:
15-Dec-2018 09:14:08 2018-12-15 04:14:08.482 debian-buster-amd64/stage-0/build: dpkg-buildpackage -us -uc -ui failed
15-Dec-2018 09:14:09 2018-12-15 04:14:09.422 debian-buster-amd64/stage-0/build: failed, exit status 29
15-Dec-2018 09:14:09 2018-12-15 04:14:09.422 debian-buster-amd64/stage-0: stage failed
15-Dec-2018 09:14:09 2018-12-15 04:14:09.422 debian-buster-amd64: removing workspace a1c2cf9b-d597-419a-8fb8-c3e028a8ea85
15-Dec-2018 09:14:09 2018-12-15 04:14:09.594 remove workspace: a1c2cf9b-d597-419a-8fb8-c3e028a8ea85
15-Dec-2018 09:14:09 2018-12-15 04:14:09.598 debian-buster-amd64: removed workspace a1c2cf9b-d597-419a-8fb8-c3e028a8ea85
15-Dec-2018 09:14:09 2018-12-15 04:14:09.599 debian-buster-amd64: removing network 7d05c0c4-e6f3-4d49-ab3c-6bdbb95d4151
15-Dec-2018 09:14:10 2018-12-15 04:14:10.209 remove network: 7d05c0c4-e6f3-4d49-ab3c-6bdbb95d4151
15-Dec-2018 09:14:10 2018-12-15 04:14:10.213 debian-buster-amd64: removed network 7d05c0c4-e6f3-4d49-ab3c-6bdbb95d4151
15-Dec-2018 09:14:10 2018-12-15 04:14:10.214 convey-runner: exit status 29
Collapse debian stretch amd64 distros Download or View
15-Dec-2018 09:13:32 2018-12-15 04:13:32.995 debian-stretch-amd64/stage-0/build: Native dependency glib-2.0 found: YES 2.50.3
15-Dec-2018 09:13:32 2018-12-15 04:13:32.995 debian-stretch-amd64/stage-0/build: Native dependency gobject-2.0 found: YES 2.50.3
15-Dec-2018 09:13:32 2018-12-15 04:13:32.995 debian-stretch-amd64/stage-0/build: Native dependency gmodule-2.0 found: YES 2.50.3
15-Dec-2018 09:13:32 2018-12-15 04:13:32.995 debian-stretch-amd64/stage-0/build: Compiler for c supports argument -Wformat: YES
15-Dec-2018 09:13:32 2018-12-15 04:13:32.995 debian-stretch-amd64/stage-0/build: Compiler for c supports arguments -Wformat -Werror=format-security: YES
15-Dec-2018 09:13:32 2018-12-15 04:13:32.995 debian-stretch-amd64/stage-0/build:
15-Dec-2018 09:13:32 2018-12-15 04:13:32.995 debian-stretch-amd64/stage-0/build: Meson encountered an error in file meson.build, line 103, column 2:
15-Dec-2018 09:13:32 2018-12-15 04:13:32.995 debian-stretch-amd64/stage-0/build: Error encountered: Meson 0.41.2 or newer is required to build documentation.
15-Dec-2018 09:13:33 2018-12-15 04:13:33.041 debian-stretch-amd64/stage-0/build: debian/rules:17: recipe for target 'override_dh_auto_configure' failed
15-Dec-2018 09:13:33 2018-12-15 04:13:33.041 debian-stretch-amd64/stage-0/build: make[1]: *** [override_dh_auto_configure] Error 1
15-Dec-2018 09:13:33 2018-12-15 04:13:33.041 debian-stretch-amd64/stage-0/build: make[1]: Leaving directory '/workspace'
15-Dec-2018 09:13:33 2018-12-15 04:13:33.048 debian-stretch-amd64/stage-0/build: debian/rules:11: recipe for target 'build' failed
15-Dec-2018 09:13:33 2018-12-15 04:13:33.048 debian-stretch-amd64/stage-0/build: make: *** [build] Error 2
15-Dec-2018 09:13:33 2018-12-15 04:13:33.049 debian-stretch-amd64/stage-0/build: dpkg-buildpackage: error: debian/rules build gave error exit status 2
15-Dec-2018 09:13:33 2018-12-15 04:13:33.059 debian-stretch-amd64/stage-0/build: debuild: fatal error at line 1116:
15-Dec-2018 09:13:33 2018-12-15 04:13:33.059 debian-stretch-amd64/stage-0/build: dpkg-buildpackage -rfakeroot -us -uc failed
15-Dec-2018 09:13:33 2018-12-15 04:13:33.918 debian-stretch-amd64/stage-0/build: failed, exit status 29
15-Dec-2018 09:13:33 2018-12-15 04:13:33.918 debian-stretch-amd64/stage-0: stage failed
15-Dec-2018 09:13:33 2018-12-15 04:13:33.918 debian-stretch-amd64: removing workspace a730786d-5542-4c20-b1f5-c22f868d8d5c
15-Dec-2018 09:13:34 2018-12-15 04:13:34.058 remove workspace: a730786d-5542-4c20-b1f5-c22f868d8d5c
15-Dec-2018 09:13:34 2018-12-15 04:13:34.062 debian-stretch-amd64: removed workspace a730786d-5542-4c20-b1f5-c22f868d8d5c
15-Dec-2018 09:13:34 2018-12-15 04:13:34.062 debian-stretch-amd64: removing network d0b50d03-5da0-4e1f-b0de-5ed165ed65e2
15-Dec-2018 09:13:34 2018-12-15 04:13:34.667 remove network: d0b50d03-5da0-4e1f-b0de-5ed165ed65e2
15-Dec-2018 09:13:34 2018-12-15 04:13:34.677 debian-stretch-amd64: removed network d0b50d03-5da0-4e1f-b0de-5ed165ed65e2
15-Dec-2018 09:13:34 2018-12-15 04:13:34.677 convey-runner: exit status 29
Collapse ubuntu bionic amd64 distros Download or View
15-Dec-2018 09:13:20 2018-12-15 04:13:20.009 ubuntu-bionic-amd64/stage-0/build:         chown 0:0 -- debian/.debhelper/libgplugin-gtk-bin/dbgsym-root/DEBIAN/md5sums
15-Dec-2018 09:13:20 2018-12-15 04:13:20.009 ubuntu-bionic-amd64/stage-0/build:         chmod 0644 -- debian/.debhelper/libgplugin-python/dbgsym-root/DEBIAN/md5sums
15-Dec-2018 09:13:20 2018-12-15 04:13:20.009 ubuntu-bionic-amd64/stage-0/build:         chown 0:0 -- debian/.debhelper/libgplugin-python/dbgsym-root/DEBIAN/md5sums
15-Dec-2018 09:13:20 2018-12-15 04:13:20.015 ubuntu-bionic-amd64/stage-0/build:    debian/rules override_dh_builddeb
15-Dec-2018 09:13:20 2018-12-15 04:13:20.020 ubuntu-bionic-amd64/stage-0/build: make[1]: Entering directory '/workspace'
15-Dec-2018 09:13:20 2018-12-15 04:13:20.020 ubuntu-bionic-amd64/stage-0/build: # copy the dsc and the tar file to the uploads dir
15-Dec-2018 09:13:20 2018-12-15 04:13:20.022 ubuntu-bionic-amd64/stage-0/build: cp ../gplugin_*.dsc ../gplugin_*.tar.* ../gplugin_*.changes /workspace/ubuntu-bionic-amd64
15-Dec-2018 09:13:20 2018-12-15 04:13:20.029 ubuntu-bionic-amd64/stage-0/build: cp: cannot stat '../gplugin_*.changes': No such file or directory
15-Dec-2018 09:13:20 2018-12-15 04:13:20.029 ubuntu-bionic-amd64/stage-0/build: debian/rules:30: recipe for target 'override_dh_builddeb' failed
15-Dec-2018 09:13:20 2018-12-15 04:13:20.029 ubuntu-bionic-amd64/stage-0/build: make[1]: *** [override_dh_builddeb] Error 1
15-Dec-2018 09:13:20 2018-12-15 04:13:20.029 ubuntu-bionic-amd64/stage-0/build: make[1]: Leaving directory '/workspace'
15-Dec-2018 09:13:20 2018-12-15 04:13:20.035 ubuntu-bionic-amd64/stage-0/build: debian/rules:11: recipe for target 'binary' failed
15-Dec-2018 09:13:20 2018-12-15 04:13:20.035 ubuntu-bionic-amd64/stage-0/build: make: *** [binary] Error 2
15-Dec-2018 09:13:20 2018-12-15 04:13:20.036 ubuntu-bionic-amd64/stage-0/build: dpkg-buildpackage: error: fakeroot debian/rules binary subprocess returned exit status 2
15-Dec-2018 09:13:20 2018-12-15 04:13:20.044 ubuntu-bionic-amd64/stage-0/build: debuild: fatal error at line 1152:
15-Dec-2018 09:13:20 2018-12-15 04:13:20.044 ubuntu-bionic-amd64/stage-0/build: dpkg-buildpackage -rfakeroot -us -uc -ui --buildinfo-option=-u/workspace/ubuntu-bionic-amd64 --changes-option=-u/workspace/ubuntu-bionic-amd64 failed
15-Dec-2018 09:13:21 2018-12-15 04:13:21.003 ubuntu-bionic-amd64/stage-0/build: failed, exit status 29
15-Dec-2018 09:13:21 2018-12-15 04:13:21.003 ubuntu-bionic-amd64/stage-0: stage failed
15-Dec-2018 09:13:21 2018-12-15 04:13:21.003 ubuntu-bionic-amd64: removing workspace 831e526a-f61c-45c7-a4ff-f4dff3434de2
15-Dec-2018 09:13:21 2018-12-15 04:13:21.158 remove workspace: 831e526a-f61c-45c7-a4ff-f4dff3434de2
15-Dec-2018 09:13:21 2018-12-15 04:13:21.162 ubuntu-bionic-amd64: removed workspace 831e526a-f61c-45c7-a4ff-f4dff3434de2
15-Dec-2018 09:13:21 2018-12-15 04:13:21.162 ubuntu-bionic-amd64: removing network 87506e92-39a2-4180-8c57-ceaad63903cc
15-Dec-2018 09:13:21 2018-12-15 04:13:21.709 remove network: 87506e92-39a2-4180-8c57-ceaad63903cc
15-Dec-2018 09:13:21 2018-12-15 04:13:21.713 ubuntu-bionic-amd64: removed network 87506e92-39a2-4180-8c57-ceaad63903cc
15-Dec-2018 09:13:21 2018-12-15 04:13:21.714 convey-runner: exit status 29