Build: #232 failed

Job: Default Job failed

Stages & jobs

  1. Default Stage

Build log

The build generated 866 lines of output. Download or view full build log

23-Jan-2019 23:41:23 Build Pidgin - cmaiku - Default Job #232 (PGN-MAIK-JOB1-232) started building on agent atlantis.internal.rekkanoryo.net
23-Jan-2019 23:41:23 Remote agent on host atlantis.internal.rekkanoryo.net
23-Jan-2019 23:41:23 Build working directory is /opt/atlassian/bamboo/agent-home/xml-data/build-dir/PGN-MAIK-JOB1
23-Jan-2019 23:41:23 Executing build Pidgin - cmaiku - Default Job #232 (PGN-MAIK-JOB1-232)
23-Jan-2019 23:41:23 Starting task 'Checkout Default Repository' of type 'com.atlassian.bamboo.plugins.vcs:task.vcs.checkout'
23-Jan-2019 23:41:23 Checking out into /opt/atlassian/bamboo/agent-home/xml-data/build-dir/PGN-MAIK-JOB1
23-Jan-2019 23:41:23 Updating source code to revision: 92213bd9538bfde870103f66b027ac9889e8a62c
23-Jan-2019 23:41:23 Retrieving source from remote repository...
23-Jan-2019 23:41:23 Pulling from repository [https://rw_grim:********@bitbucket.org/CMaiku/pidgin] to directory '/opt/atlassian/bamboo/agent-home/xml-data/build-dir/_hg-repositories-cache/d1bacfbc3865ab1d729762e37fb4ff17d17ff56c' revision `92213bd9538bfde870103f66b027ac9889e8a62c'
23-Jan-2019 23:41:24 pulling from https://rw_grim:***@bitbucket.org/CMaiku/pidgin
23-Jan-2019 23:41:24 searching for changes
23-Jan-2019 23:41:24 adding changesets
23-Jan-2019 23:41:24 adding manifests
23-Jan-2019 23:41:24 adding file changes
23-Jan-2019 23:41:24 added 2 changesets with 5 changes to 3 files
23-Jan-2019 23:41:25 adding remote bookmark port-to-new-gplugin
23-Jan-2019 23:41:25 new changesets e8e189c88b13:92213bd9538b (2 drafts)
23-Jan-2019 23:41:25 7 local changesets published
23-Jan-2019 23:41:25 (run 'hg update' to get a working copy)
23-Jan-2019 23:41:25 Obtaining remote repository to agent's cache directory '/opt/atlassian/bamboo/agent-home/xml-data/build-dir/_hg-repositories-cache/d1bacfbc3865ab1d729762e37fb4ff17d17ff56c'...
23-Jan-2019 23:41:25 Pulling from repository [/opt/atlassian/bamboo/agent-home/xml-data/build-dir/_hg-repositories-cache/d1bacfbc3865ab1d729762e37fb4ff17d17ff56c] to directory '/opt/atlassian/bamboo/agent-home/xml-data/build-dir/PGN-MAIK-JOB1' revision `92213bd9538bfde870103f66b027ac9889e8a62c'
23-Jan-2019 23:41:25 pulling from /opt/atlassian/bamboo/agent-home/xml-data/build-dir/_hg-repositories-cache/d1bacfbc3865ab1d729762e37fb4ff17d17ff56c
23-Jan-2019 23:41:25 searching for changes
23-Jan-2019 23:41:25 adding changesets
23-Jan-2019 23:41:25 adding manifests
23-Jan-2019 23:41:25 adding file changes
23-Jan-2019 23:41:25 added 2 changesets with 5 changes to 3 files
23-Jan-2019 23:41:25 adding remote bookmark port-to-new-gplugin
23-Jan-2019 23:41:25 new changesets e8e189c88b13:92213bd9538b
23-Jan-2019 23:41:25 (run 'hg update' to get a working copy)
23-Jan-2019 23:41:29 3 files updated, 0 files merged, 0 files removed, 0 files unresolved
23-Jan-2019 23:41:29 Updated source code to revision: 92213bd9538bfde870103f66b027ac9889e8a62c
23-Jan-2019 23:41:29 Finished task 'Checkout Default Repository' with result: Success
23-Jan-2019 23:41:29 Running pre-build action: VCS Version Collector
23-Jan-2019 23:41:29 Starting task 'Run bitbucket pipelines' of type 'com.atlassian.bamboo.plugins.scripttask:task.builder.script'
23-Jan-2019 23:41:29
Beginning to execute external process for build 'Pidgin - cmaiku - Default Job #232 (PGN-MAIK-JOB1-232)'
... running command line:
/opt/atlassian/bamboo/agent-home/temp/PGN-MAIK-JOB1-232-ScriptBuildTask-8314375982089626720.sh
... in: /opt/atlassian/bamboo/agent-home/xml-data/build-dir/PGN-MAIK-JOB1
... using extra environment variables:
bamboo_planRepository_1_branch=default
bamboo_repository_3014659_revision_number=92213bd9538bfde870103f66b027ac9889e8a62c
bamboo_planRepository_1_branchDisplayName=default
bamboo_GRIM_DOCKERHUB_PASSWORD=********
bamboo_repository_revision_number=92213bd9538bfde870103f66b027ac9889e8a62c
bamboo_resultsUrl=https://bamboo.pidgin.im/browse/PGN-MAIK-JOB1-232
bamboo_build_working_directory=/opt/atlassian/bamboo/agent-home/xml-data/build-dir/PGN-MAIK-JOB1
bamboo_planRepository_1_name=bitbucket.org/CMaiku/pidgin
bamboo_buildKey=PGN-MAIK-JOB1
bamboo_capability_system_builder_command_Convey=/usr/local/bin/convey
bamboo_shortPlanName=cmaiku
bamboo_planRepository_name=bitbucket.org/CMaiku/pidgin
bamboo_buildNumber=232
bamboo_shortJobName=Default Job
bamboo_buildResultsUrl=https://bamboo.pidgin.im/browse/PGN-MAIK-JOB1-232
bamboo_planRepository_repositoryUrl=https://bitbucket.org/CMaiku/pidgin
bamboo_agentId=6160385
bamboo_planName=Pidgin - cmaiku
bamboo_shortPlanKey=MAIK
bamboo_shortJobKey=JOB1
bamboo_planRepository_revision=92213bd9538bfde870103f66b027ac9889e8a62c
bamboo_repository_3014659_branch_name=default
bamboo_buildTimeStamp=2019-01-23T23:41:22.807Z
bamboo_repository_previous_revision_number=b117963f4ff8c653638661560c58b5c12662a755
bamboo_planRepository_previousRevision=b117963f4ff8c653638661560c58b5c12662a755
bamboo_buildResultKey=PGN-MAIK-JOB1-232
bamboo_repository_branch_name=default
bamboo_buildPlanName=Pidgin - cmaiku - Default Job
bamboo_planRepository_1_revision=92213bd9538bfde870103f66b027ac9889e8a62c
bamboo_capability_system_hg_executable=/usr/bin/hg
bamboo_capability_agent_Name=bamboo-at
bamboo_repository_name=bitbucket.org/CMaiku/pidgin
bamboo_buildFailed=false
bamboo_capability_system_docker_executable=/usr/bin/docker
bamboo_planRepository_branch=default
bamboo_agentWorkingDirectory=/opt/atlassian/bamboo/agent-home/xml-data/build-dir
bamboo_capability_system_git_executable=/usr/bin/git
bamboo_planRepository_1_previousRevision=b117963f4ff8c653638661560c58b5c12662a755
bamboo_planRepository_branchDisplayName=default
bamboo_planRepository_1_type=bbCloud
bamboo_planRepository_branchName=default
bamboo_GRIM_PVS_STUDIO_USERNAME=grim@reaperworld.com
bamboo_capability_system_jdk_JDK=/usr/lib/jvm/jdk1.8.0_162
bamboo_plan_storageTag=plan-2850819
bamboo_GRIM_DOCKERHUB_USERNAME=rwgrim
bamboo_hg_cache_directory=/opt/atlassian/bamboo/agent-home/xml-data/build-dir/_hg-repositories-cache
bamboo_planRepository_1_username=rw_grim
bamboo_planRepository_type=bbCloud
bamboo_git_cache_directory=/opt/atlassian/bamboo/agent-home/xml-data/build-dir/_git-repositories-cache
bamboo_tmp_directory=/opt/atlassian/bamboo/agent-home/temp
bamboo_working_directory=/opt/atlassian/bamboo/agent-home/xml-data/build-dir/PGN-MAIK-JOB1
bamboo_planKey=PGN-MAIK
bamboo_repository_3014659_name=bitbucket.org/CMaiku/pidgin
bamboo_planRepository_1_repositoryUrl=https://bitbucket.org/CMaiku/pidgin
bamboo_GRIM_PACKAGECLOUD_TOKEN_SECRET=********
bamboo_planRepository_username=rw_grim
bamboo_GRIM_PVS_STUDIO_KEY_SECRET=********
bamboo_capability_system_jdk_JDK_1_8=/usr/lib/jvm/jdk1.8.0_162
bamboo_capability_system_jdk_JDK_1_8_0_162=/usr/lib/jvm/jdk1.8.0_162
bamboo_repository_3014659_previous_revision_number=b117963f4ff8c653638661560c58b5c12662a755
bamboo_planRepository_1_branchName=default
23-Jan-2019 23:41:30 2019-01-23 18:41:30.460 default: creating network...
23-Jan-2019 23:41:31 2019-01-23 18:41:31.042 default: created network c63c1cfe-355d-43ab-b71b-c9438b9c3961
23-Jan-2019 23:41:31 2019-01-23 18:41:31.042 default: creating workspace...
23-Jan-2019 23:41:32 2019-01-23 18:41:32.144 default: created workspace 8a4713b0-2d30-4f24-9ba4-109826a58d6d
23-Jan-2019 23:41:32 2019-01-23 18:41:32.144 default/stage-0: stage starting
23-Jan-2019 23:41:32 2019-01-23 18:41:32.144 default/stage-0/import: starting
23-Jan-2019 23:41:45 2019-01-23 18:41:45.238 default/stage-0/import: finished
23-Jan-2019 23:41:45 2019-01-23 18:41:45.238 default/stage-0/default-step-0-0: starting
23-Jan-2019 23:41:45 2019-01-23 18:41:45.240 default/stage-0/default-step-0-0: running container with id bd2674
23-Jan-2019 23:41:45 2019-01-23 18:41:45.284 default/stage-0/default-step-0-0: Unable to find image 'pidgin/builder-debian:buster' locally
23-Jan-2019 23:41:45 2019-01-23 18:41:45.944 default/stage-0/default-step-0-0: buster: Pulling from pidgin/builder-debian
23-Jan-2019 23:41:45 2019-01-23 18:41:45.958 default/stage-0/default-step-0-0: 6e8f29bc2816: Pulling fs layer
23-Jan-2019 23:41:45 2019-01-23 18:41:45.958 default/stage-0/default-step-0-0: 475494a55821: Pulling fs layer
23-Jan-2019 23:41:45 2019-01-23 18:41:45.958 default/stage-0/default-step-0-0: e81b240bc536: Pulling fs layer
23-Jan-2019 23:41:45 2019-01-23 18:41:45.958 default/stage-0/default-step-0-0: cf8ced873799: Pulling fs layer
23-Jan-2019 23:41:45 2019-01-23 18:41:45.958 default/stage-0/default-step-0-0: 9e50be2f396d: Pulling fs layer
23-Jan-2019 23:41:45 2019-01-23 18:41:45.958 default/stage-0/default-step-0-0: cf8ced873799: Waiting
23-Jan-2019 23:41:45 2019-01-23 18:41:45.958 default/stage-0/default-step-0-0: 9e50be2f396d: Waiting
23-Jan-2019 23:41:46 2019-01-23 18:41:46.594 default/stage-0/default-step-0-0: 475494a55821: Download complete
23-Jan-2019 23:41:52 2019-01-23 18:41:52.050 default/stage-0/default-step-0-0: e81b240bc536: Verifying Checksum
23-Jan-2019 23:41:52 2019-01-23 18:41:52.050 default/stage-0/default-step-0-0: e81b240bc536: Download complete
23-Jan-2019 23:41:52 2019-01-23 18:41:52.829 default/stage-0/default-step-0-0: 9e50be2f396d: Verifying Checksum
23-Jan-2019 23:41:52 2019-01-23 18:41:52.829 default/stage-0/default-step-0-0: 9e50be2f396d: Download complete
23-Jan-2019 23:42:01 2019-01-23 18:42:01.934 default/stage-0/default-step-0-0: 6e8f29bc2816: Verifying Checksum
23-Jan-2019 23:42:01 2019-01-23 18:42:01.934 default/stage-0/default-step-0-0: 6e8f29bc2816: Download complete
23-Jan-2019 23:42:08 2019-01-23 18:42:08.736 default/stage-0/default-step-0-0: 6e8f29bc2816: Pull complete
23-Jan-2019 23:42:09 2019-01-23 18:42:09.255 default/stage-0/default-step-0-0: 475494a55821: Pull complete
23-Jan-2019 23:42:16 2019-01-23 18:42:16.365 default/stage-0/default-step-0-0: e81b240bc536: Pull complete
23-Jan-2019 23:42:55 2019-01-23 18:42:55.960 default/stage-0/default-step-0-0: cf8ced873799: Verifying Checksum
23-Jan-2019 23:42:55 2019-01-23 18:42:55.960 default/stage-0/default-step-0-0: cf8ced873799: Download complete
23-Jan-2019 23:43:44 2019-01-23 18:43:44.531 default/stage-0/default-step-0-0: cf8ced873799: Pull complete
23-Jan-2019 23:43:45 2019-01-23 18:43:45.240 default/stage-0/default-step-0-0: 9e50be2f396d: Pull complete
23-Jan-2019 23:43:45 2019-01-23 18:43:45.383 default/stage-0/default-step-0-0: Digest: sha256:810dbe80a059f162f891f21bb882843c4a669562349a723d2cd95fa05b5d1b63
23-Jan-2019 23:43:45 2019-01-23 18:43:45.466 default/stage-0/default-step-0-0: Status: Downloaded newer image for pidgin/builder-debian:buster
23-Jan-2019 23:43:48 2019-01-23 18:43:48.587 default/stage-0/default-step-0-0: + hg clone https://bitbucket.org/pidgin/talkatu
23-Jan-2019 23:43:52 2019-01-23 18:43:52.027 default/stage-0/default-step-0-0: destination directory: talkatu
23-Jan-2019 23:43:52 2019-01-23 18:43:52.027 default/stage-0/default-step-0-0: requesting all changes
23-Jan-2019 23:43:52 2019-01-23 18:43:52.027 default/stage-0/default-step-0-0: adding changesets
23-Jan-2019 23:43:52 2019-01-23 18:43:52.027 default/stage-0/default-step-0-0: adding manifests
23-Jan-2019 23:43:52 2019-01-23 18:43:52.027 default/stage-0/default-step-0-0: adding file changes
23-Jan-2019 23:43:52 2019-01-23 18:43:52.027 default/stage-0/default-step-0-0: added 216 changesets with 722 changes to 158 files
23-Jan-2019 23:43:52 2019-01-23 18:43:52.105 default/stage-0/default-step-0-0: new changesets 0feed1461a4a:b31d43a01132
23-Jan-2019 23:43:52 2019-01-23 18:43:52.105 default/stage-0/default-step-0-0: updating to branch default
23-Jan-2019 23:43:52 2019-01-23 18:43:52.105 default/stage-0/default-step-0-0: 95 files updated, 0 files merged, 0 files removed, 0 files unresolved
23-Jan-2019 23:43:52 2019-01-23 18:43:52.138 default/stage-0/default-step-0-0: + meson -Dprefix=/usr talkatu talkatu/build
23-Jan-2019 23:43:54 2019-01-23 18:43:54.047 default/stage-0/default-step-0-0: The Meson build system
23-Jan-2019 23:43:54 2019-01-23 18:43:54.047 default/stage-0/default-step-0-0: Version: 0.47.2
23-Jan-2019 23:43:54 2019-01-23 18:43:54.047 default/stage-0/default-step-0-0: Source dir: /workspace/talkatu
23-Jan-2019 23:43:54 2019-01-23 18:43:54.047 default/stage-0/default-step-0-0: Build dir: /workspace/talkatu/build
23-Jan-2019 23:43:54 2019-01-23 18:43:54.047 default/stage-0/default-step-0-0: Build type: native build
23-Jan-2019 23:43:54 2019-01-23 18:43:54.047 default/stage-0/default-step-0-0: Project name: talkatu
23-Jan-2019 23:43:54 2019-01-23 18:43:54.047 default/stage-0/default-step-0-0: Project version: 0.1.0-dev
23-Jan-2019 23:43:54 2019-01-23 18:43:54.047 default/stage-0/default-step-0-0: Native C compiler: cc (gcc 8.2.0 "cc (Debian 8.2.0-6) 8.2.0")
23-Jan-2019 23:43:54 2019-01-23 18:43:54.047 default/stage-0/default-step-0-0: Build machine cpu family: x86_64
23-Jan-2019 23:43:54 2019-01-23 18:43:54.047 default/stage-0/default-step-0-0: Build machine cpu: x86_64
23-Jan-2019 23:43:54 2019-01-23 18:43:54.047 default/stage-0/default-step-0-0: Found pkg-config: /usr/bin/pkg-config (0.29)
23-Jan-2019 23:43:54 2019-01-23 18:43:54.047 default/stage-0/default-step-0-0: Native dependency glib-2.0 found: YES 2.56.1
23-Jan-2019 23:43:54 2019-01-23 18:43:54.047 default/stage-0/default-step-0-0: Native dependency gobject-2.0 found: YES 2.56.1
23-Jan-2019 23:43:54 2019-01-23 18:43:54.047 default/stage-0/default-step-0-0: Native dependency gtk+-3.0 found: YES 3.22.30
23-Jan-2019 23:43:54 2019-01-23 18:43:54.047 default/stage-0/default-step-0-0: Native dependency gladeui-2.0 found: YES 3.22.1
23-Jan-2019 23:43:54 2019-01-23 18:43:54.047 default/stage-0/default-step-0-0: Native dependency gspell-1 found: YES 1.6.1
23-Jan-2019 23:43:54 2019-01-23 18:43:54.047 default/stage-0/default-step-0-0: Native dependency gumbo found: YES 0.10.1
23-Jan-2019 23:43:54 2019-01-23 18:43:54.047 default/stage-0/default-step-0-0: Native dependency libcmark found: YES 0.28.3
23-Jan-2019 23:43:54 2019-01-23 18:43:54.047 default/stage-0/default-step-0-0: Program help2man found: YES (/usr/bin/help2man)
23-Jan-2019 23:43:54 2019-01-23 18:43:54.047 default/stage-0/default-step-0-0: Program xvfb-run found: YES (/usr/bin/xvfb-run)
23-Jan-2019 23:43:54 2019-01-23 18:43:54.047 default/stage-0/default-step-0-0: Compiler for C supports arguments -Wformat: YES
23-Jan-2019 23:43:54 2019-01-23 18:43:54.047 default/stage-0/default-step-0-0: Compiler for C supports arguments -Wformat -Werror=format-security: YES
23-Jan-2019 23:43:54 2019-01-23 18:43:54.047 default/stage-0/default-step-0-0: Native dependency glib-2.0 found: YES 2.56.1
23-Jan-2019 23:43:54 2019-01-23 18:43:54.047 default/stage-0/default-step-0-0: Configuring talkatuversion.h using configuration
23-Jan-2019 23:43:54 2019-01-23 18:43:54.047 default/stage-0/default-step-0-0: Configuring talkatu.h using configuration
23-Jan-2019 23:43:54 2019-01-23 18:43:54.047 default/stage-0/default-step-0-0: Native dependency gobject-introspection-1.0 found: YES 1.56.1
23-Jan-2019 23:43:54 2019-01-23 18:43:54.047 default/stage-0/default-step-0-0: Program ./test-wrapper.py found: YES (/workspace/talkatu/talkatu/tests/./test-wrapper.py)
23-Jan-2019 23:43:54 2019-01-23 18:43:54.047 default/stage-0/default-step-0-0: Configuring version.xml using configuration
23-Jan-2019 23:43:54 2019-01-23 18:43:54.047 default/stage-0/default-step-0-0: Configuring talkatu.spec using configuration
23-Jan-2019 23:43:54 2019-01-23 18:43:54.047 default/stage-0/default-step-0-0: Build targets in project: 17
23-Jan-2019 23:43:54 2019-01-23 18:43:54.047 default/stage-0/default-step-0-0: Found ninja-1.8.2 at /usr/bin/ninja
23-Jan-2019 23:43:54 2019-01-23 18:43:54.090 default/stage-0/default-step-0-0: + ninja -C talkatu/build install
23-Jan-2019 23:43:54 2019-01-23 18:43:54.094 default/stage-0/default-step-0-0: ninja: Entering directory `talkatu/build'
23-Jan-2019 23:43:54 2019-01-23 18:43:54.109 default/stage-0/default-step-0-0: [1/42] Generating talkaturesources_h with a custom command.
23-Jan-2019 23:43:54 2019-01-23 18:43:54.112 default/stage-0/default-step-0-0: [2/42] Generating talkatudemoresources_c with a custom command.
23-Jan-2019 23:43:54 2019-01-23 18:43:54.112 default/stage-0/default-step-0-0: [3/42] Generating talkatudemoresources_h with a custom command.
23-Jan-2019 23:43:54 2019-01-23 18:43:54.113 default/stage-0/default-step-0-0: [4/42] Generating talkaturesources_c with a custom command.
23-Jan-2019 23:43:54 2019-01-23 18:43:54.497 default/stage-0/default-step-0-0: [5/42] Generating talkatuenums.h with a meson_exe.py custom command.
23-Jan-2019 23:43:54 2019-01-23 18:43:54.629 default/stage-0/default-step-0-0: [6/42] Compiling C object 'talkatu/talkatu@@talkatu@sha/talkatucore.c.o'.
23-Jan-2019 23:43:54 2019-01-23 18:43:54.711 default/stage-0/default-step-0-0: [7/42] Compiling C object 'talkatu/talkatu@@talkatu@sha/talkatucodeset.c.o'.
23-Jan-2019 23:43:54 2019-01-23 18:43:54.751 default/stage-0/default-step-0-0: [8/42] Compiling C object 'talkatu/talkatu@@talkatu@sha/meson-generated_.._talkaturesources.c.o'.
23-Jan-2019 23:43:55 2019-01-23 18:43:55.011 default/stage-0/default-step-0-0: [9/42] Compiling C object 'talkatu/talkatu@@talkatu@sha/talkatuhtmlbuffer.c.o'.
23-Jan-2019 23:43:55 2019-01-23 18:43:55.017 default/stage-0/default-step-0-0: [10/42] Compiling C object 'talkatu/talkatu@@talkatu@sha/talkatuhistory.c.o'.
23-Jan-2019 23:43:55 2019-01-23 18:43:55.040 default/stage-0/default-step-0-0: [11/42] Compiling C object 'talkatu/talkatu@@talkatu@sha/talkatumessage.c.o'.
23-Jan-2019 23:43:55 2019-01-23 18:43:55.042 default/stage-0/default-step-0-0: [12/42] Compiling C object 'talkatu/talkatu@@talkatu@sha/talkatumenutoolbutton.c.o'.
23-Jan-2019 23:43:55 2019-01-23 18:43:55.048 default/stage-0/default-step-0-0: [13/42] Compiling C object 'talkatu/talkatu@@talkatu@sha/talkatutag.c.o'.
23-Jan-2019 23:43:55 2019-01-23 18:43:55.049 default/stage-0/default-step-0-0: [14/42] Compiling C object 'talkatu/talkatu@@talkatu@sha/talkatumessageactions.c.o'.
23-Jan-2019 23:43:55 2019-01-23 18:43:55.058 default/stage-0/default-step-0-0: [15/42] Compiling C object 'talkatu/talkatu@@talkatu@sha/talkatueditor.c.o'.
23-Jan-2019 23:43:55 2019-01-23 18:43:55.059 default/stage-0/default-step-0-0: [16/42] Compiling C object 'talkatu/talkatu@@talkatu@sha/talkatutagtable.c.o'.
23-Jan-2019 23:43:55 2019-01-23 18:43:55.067 default/stage-0/default-step-0-0: [17/42] Compiling C object 'talkatu/talkatu@@talkatu@sha/talkatubuffer.c.o'.
23-Jan-2019 23:43:55 2019-01-23 18:43:55.079 default/stage-0/default-step-0-0: [18/42] Compiling C object 'talkatu/talkatu@@talkatu@sha/talkatumarkup.c.o'.
23-Jan-2019 23:43:55 2019-01-23 18:43:55.082 default/stage-0/default-step-0-0: [19/42] Compiling C object 'talkatu/talkatu@@talkatu@sha/talkatumarkdownbuffer.c.o'.
23-Jan-2019 23:43:55 2019-01-23 18:43:55.082 default/stage-0/default-step-0-0: [20/42] Compiling C object 'talkatu/talkatu@@talkatu@sha/talkatuhistorybuffer.c.o'.
23-Jan-2019 23:43:55 2019-01-23 18:43:55.086 default/stage-0/default-step-0-0: [21/42] Compiling C object 'talkatu/talkatu@@talkatu@sha/talkatuactiongroup.c.o'.
23-Jan-2019 23:43:55 2019-01-23 18:43:55.092 default/stage-0/default-step-0-0: [22/42] Compiling C object 'talkatu/talkatu@@talkatu@sha/talkatulinkdialog.c.o'.
23-Jan-2019 23:43:55 2019-01-23 18:43:55.122 default/stage-0/default-step-0-0: [23/42] Generating talkatuenums.c with a meson_exe.py custom command.
23-Jan-2019 23:43:55 2019-01-23 18:43:55.271 default/stage-0/default-step-0-0: [24/42] Compiling C object 'demo/demo@@talkatu-demo@exe/meson-generated_.._talkatudemoresources.c.o'.
23-Jan-2019 23:43:55 2019-01-23 18:43:55.307 default/stage-0/default-step-0-0: [25/42] Compiling C object 'talkatu/talkatu@@talkatu@sha/talkatutooldrawer.c.o'.
23-Jan-2019 23:43:55 2019-01-23 18:43:55.367 default/stage-0/default-step-0-0: [26/42] Compiling C object 'talkatu/talkatu@@talkatu@sha/talkatutoolbar.c.o'.
23-Jan-2019 23:43:55 2019-01-23 18:43:55.383 default/stage-0/default-step-0-0: [27/42] Compiling C object 'talkatu/talkatu@@talkatu@sha/talkatuview.c.o'.
23-Jan-2019 23:43:55 2019-01-23 18:43:55.383 default/stage-0/default-step-0-0: ../talkatu/talkatuview.c:208:1: warning: ?talkatu_view_copy_url_cb? defined but not used [-Wunused-function]
23-Jan-2019 23:43:55 2019-01-23 18:43:55.383 default/stage-0/default-step-0-0: talkatu_view_copy_url_cb(GtkMenuItem *item, gpointer data) {
23-Jan-2019 23:43:55 2019-01-23 18:43:55.383 default/stage-0/default-step-0-0: ^~~~~~~~~~~~~~~~~~~~~~~~
23-Jan-2019 23:43:55 2019-01-23 18:43:55.383 default/stage-0/default-step-0-0: ../talkatu/talkatuview.c:194:1: warning: ?talkatu_view_open_url_cb? defined but not used [-Wunused-function]
23-Jan-2019 23:43:55 2019-01-23 18:43:55.383 default/stage-0/default-step-0-0: talkatu_view_open_url_cb(GtkMenuItem *item, gpointer data) {
23-Jan-2019 23:43:55 2019-01-23 18:43:55.383 default/stage-0/default-step-0-0: ^~~~~~~~~~~~~~~~~~~~~~~~
23-Jan-2019 23:43:55 2019-01-23 18:43:55.506 default/stage-0/default-step-0-0: [28/42] Compiling C object 'talkatu/talkatu@@talkatu@sha/talkatuwholebuffer.c.o'.
23-Jan-2019 23:43:55 2019-01-23 18:43:55.510 default/stage-0/default-step-0-0: [29/42] Compiling C object 'talkatu/tests/talkatu@tests@@test-html-serialization@exe/talkatutesthtmlserialization.c.o'.
23-Jan-2019 23:43:55 2019-01-23 18:43:55.527 default/stage-0/default-step-0-0: [30/42] Compiling C object 'talkatu/tests/talkatu@tests@@test-action-group@exe/talkatutestactiongroup.c.o'.
23-Jan-2019 23:43:55 2019-01-23 18:43:55.565 default/stage-0/default-step-0-0: [31/42] Compiling C object 'demo/demo@@talkatu-demo@exe/talkatudemo.c.o'.
23-Jan-2019 23:43:55 2019-01-23 18:43:55.571 default/stage-0/default-step-0-0: [32/42] Compiling C object 'demo/demo@@talkatu-demo@exe/talkatudemomessage.c.o'.
23-Jan-2019 23:43:55 2019-01-23 18:43:55.587 default/stage-0/default-step-0-0: [33/42] Compiling C object 'talkatu/talkatu@@talkatu@sha/meson-generated_.._talkatuenums.c.o'.
23-Jan-2019 23:43:55 2019-01-23 18:43:55.735 default/stage-0/default-step-0-0: [34/42] Linking target talkatu/libtalkatu.so.0.1.0.
23-Jan-2019 23:43:56 2019-01-23 18:43:56.045 default/stage-0/default-step-0-0: [35/42] Generating symbol file 'talkatu/talkatu@@talkatu@sha/libtalkatu.so.0.1.0.symbols'.
23-Jan-2019 23:43:56 2019-01-23 18:43:56.252 default/stage-0/default-step-0-0: [36/42] Linking target talkatu/tests/test-action-group.
23-Jan-2019 23:43:56 2019-01-23 18:43:56.280 default/stage-0/default-step-0-0: [37/42] Linking target talkatu/tests/test-html-serialization.
23-Jan-2019 23:43:56 2019-01-23 18:43:56.317 default/stage-0/default-step-0-0: [38/42] Linking target demo/talkatu-demo.
23-Jan-2019 23:43:56 2019-01-23 18:43:56.443 default/stage-0/default-step-0-0: [39/42] Generating talkatu-demo.1 with a custom command.
23-Jan-2019 23:43:59 2019-01-23 18:43:59.321 default/stage-0/default-step-0-0: [40/42] Generating Talkatu-0.0.gir with a custom command.
23-Jan-2019 23:44:00 2019-01-23 18:44:00.126 default/stage-0/default-step-0-0: [41/42] Generating Talkatu-0.0.typelib with a custom command.
23-Jan-2019 23:44:00 2019-01-23 18:44:00.126 default/stage-0/default-step-0-0: [41/42] Installing files.
23-Jan-2019 23:44:05 2019-01-23 18:44:05.544 default/stage-0/default-step-0-0: Building documentation for talkatu
23-Jan-2019 23:44:05 2019-01-23 18:44:05.544 default/stage-0/default-step-0-0: ./talkatu-unused.txt:1: warning: 15 unused declarations. They should be added to talkatu-sections.txt in the appropriate place.
23-Jan-2019 23:44:05 2019-01-23 18:44:05.544 default/stage-0/default-step-0-0:
23-Jan-2019 23:44:05 2019-01-23 18:44:05.544 default/stage-0/default-step-0-0: html/TalkatuActionGroup.html:113: warning: no link for: "GtkTextBuffer" -> (<span class="type">GtkTextBuffer</span>).
23-Jan-2019 23:44:05 2019-01-23 18:44:05.544 default/stage-0/default-step-0-0: html/TalkatuActionGroup.html:130: warning: no link for: "G-SIGNAL-ACTION:CAPS" -> (Action).
23-Jan-2019 23:44:05 2019-01-23 18:44:05.544 default/stage-0/default-step-0-0: html/TalkatuActionGroup.html:186: warning: no link for: "GAction" -> (<span class="type">GAction</span>).
23-Jan-2019 23:44:05 2019-01-23 18:44:05.544 default/stage-0/default-step-0-0: html/TalkatuActionGroup.html:303: warning: no link for: "NULL:CAPS" -> (<code class="literal">NULL</code>).
23-Jan-2019 23:44:05 2019-01-23 18:44:05.544 default/stage-0/default-step-0-0: html/TalkatuBuffer.html:122: warning: no link for: "GActionGroup" -> (<span class="type">GActionGroup</span>).
23-Jan-2019 23:44:05 2019-01-23 18:44:05.544 default/stage-0/default-step-0-0: html/TalkatuBuffer.html:174: warning: no link for: "GSimpleActionGroup" -> (<span class="type">GSimpleActionGroup</span>).
23-Jan-2019 23:44:05 2019-01-23 18:44:05.544 default/stage-0/default-step-0-0: html/TalkatuBuffer.html:187: warning: no link for: "GSimpleAction" -> (<span class="type">GSimpleAction</span>).
23-Jan-2019 23:44:05 2019-01-23 18:44:05.544 default/stage-0/default-step-0-0: html/TalkatuBuffer.html:262: warning: no link for: "GtkTextIter" -> (<span class="type">GtkTextIter</span>).
23-Jan-2019 23:44:05 2019-01-23 18:44:05.544 default/stage-0/default-step-0-0: html/TalkatuBuffer.html:463: warning: no link for: "GtkTextTags" -> (<span class="type">GtkTextTags</span>).
23-Jan-2019 23:44:05 2019-01-23 18:44:05.544 default/stage-0/default-step-0-0: html/TalkatuMenuToolButton.html:81: warning: no link for: "GtkMenu" -> (<span class="type">GtkMenu</span>).
23-Jan-2019 23:44:05 2019-01-23 18:44:05.544 default/stage-0/default-step-0-0: html/TalkatuMenuToolButton.html:101: warning: no link for: "GtkMenuToolButton" -> (<span class="type">GtkMenuToolButton</span>).
23-Jan-2019 23:44:05 2019-01-23 18:44:05.544 default/stage-0/default-step-0-0: html/TalkatuMenuToolButton.html:102: warning: no link for: "GtkToolItem" -> (<span class="type">GtkToolItem</span>).
23-Jan-2019 23:44:05 2019-01-23 18:44:05.544 default/stage-0/default-step-0-0: html/TalkatuMenuToolButton.html:111: warning: no link for: "GtkWidget" -> (<span class="type">GtkWidget</span>).
23-Jan-2019 23:44:05 2019-01-23 18:44:05.544 default/stage-0/default-step-0-0: html/TalkatuMessageActions.html:73: warning: no link for: "GObject" -> (<span class="type">GObject</span>).
23-Jan-2019 23:44:05 2019-01-23 18:44:05.544 default/stage-0/default-step-0-0: html/TalkatuToolDrawer.html:159: warning: no link for: "GtkToolItems" -> (<span class="type">GtkToolItems</span>).
23-Jan-2019 23:44:05 2019-01-23 18:44:05.544 default/stage-0/default-step-0-0: html/TalkatuToolDrawer.html:208: warning: no link for: "GCallback" -> (<span class="type">GCallback</span>).
23-Jan-2019 23:44:05 2019-01-23 18:44:05.544 default/stage-0/default-step-0-0: html/TalkatuToolDrawer.html:421: warning: no link for: "TRUE:CAPS" -> (<code class="literal">TRUE</code>).
23-Jan-2019 23:44:05 2019-01-23 18:44:05.544 default/stage-0/default-step-0-0: html/TalkatuToolDrawer.html:422: warning: no link for: "FALSE:CAPS" -> (<code class="literal">FALSE</code>).
23-Jan-2019 23:44:05 2019-01-23 18:44:05.544 default/stage-0/default-step-0-0: html/talkatu-Codeset-Helpers.html:64: warning: no link for: "GError" -> (<span class="type">GError</span>).
23-Jan-2019 23:44:05 2019-01-23 18:44:05.544 default/stage-0/default-step-0-0: html/talkatu-Markup-Helpers.html:119: warning: no link for: "GtkTextBufferDeserializeFunc" -> (<span class="type">GtkTextBufferDeserializeFunc</span>).
23-Jan-2019 23:44:05 2019-01-23 18:44:05.544 default/stage-0/default-step-0-0: html/talkatu-Markup-Helpers.html:319: warning: no link for: "GtkTextBufferSerializeFunc" -> (<span class="type">GtkTextBufferSerializeFunc</span>).
23-Jan-2019 23:44:05 2019-01-23 18:44:05.544 default/stage-0/default-step-0-0:
23-Jan-2019 23:44:05 2019-01-23 18:44:05.875 default/stage-0/default-step-0-0: Installing talkatu/talkatuenums.h to /usr/include/talkatu-1.0/talkatu
23-Jan-2019 23:44:05 2019-01-23 18:44:05.875 default/stage-0/default-step-0-0: Installing talkatu/libtalkatu.so.0.1.0 to /usr/lib/x86_64-linux-gnu
23-Jan-2019 23:44:05 2019-01-23 18:44:05.875 default/stage-0/default-step-0-0: Installing talkatu/Talkatu-0.0.gir to /usr/share/gir-1.0
23-Jan-2019 23:44:05 2019-01-23 18:44:05.875 default/stage-0/default-step-0-0: Installing talkatu/Talkatu-0.0.typelib to /usr/lib/x86_64-linux-gnu/girepository-1.0
23-Jan-2019 23:44:05 2019-01-23 18:44:05.875 default/stage-0/default-step-0-0: Installing demo/talkatu-demo to /usr/bin
23-Jan-2019 23:44:05 2019-01-23 18:44:05.875 default/stage-0/default-step-0-0: Installing demo/talkatu-demo.1 to /usr/share/man/man1
23-Jan-2019 23:44:05 2019-01-23 18:44:05.875 default/stage-0/default-step-0-0: Installing /workspace/talkatu/talkatu/talkatuactiongroup.h to /usr/include/talkatu-1.0/talkatu
23-Jan-2019 23:44:05 2019-01-23 18:44:05.875 default/stage-0/default-step-0-0: Installing /workspace/talkatu/talkatu/talkatubuffer.h to /usr/include/talkatu-1.0/talkatu
23-Jan-2019 23:44:05 2019-01-23 18:44:05.875 default/stage-0/default-step-0-0: Installing /workspace/talkatu/talkatu/talkatucodeset.h to /usr/include/talkatu-1.0/talkatu
23-Jan-2019 23:44:05 2019-01-23 18:44:05.875 default/stage-0/default-step-0-0: Installing /workspace/talkatu/talkatu/talkatucore.h to /usr/include/talkatu-1.0/talkatu
23-Jan-2019 23:44:05 2019-01-23 18:44:05.875 default/stage-0/default-step-0-0: Installing /workspace/talkatu/talkatu/talkatueditor.h to /usr/include/talkatu-1.0/talkatu
23-Jan-2019 23:44:05 2019-01-23 18:44:05.875 default/stage-0/default-step-0-0: Installing /workspace/talkatu/talkatu/talkatuhistory.h to /usr/include/talkatu-1.0/talkatu
23-Jan-2019 23:44:05 2019-01-23 18:44:05.875 default/stage-0/default-step-0-0: Installing /workspace/talkatu/talkatu/talkatuhistorybuffer.h to /usr/include/talkatu-1.0/talkatu
23-Jan-2019 23:44:05 2019-01-23 18:44:05.875 default/stage-0/default-step-0-0: Installing /workspace/talkatu/talkatu/talkatuhtmlbuffer.h to /usr/include/talkatu-1.0/talkatu
23-Jan-2019 23:44:05 2019-01-23 18:44:05.876 default/stage-0/default-step-0-0: Installing /workspace/talkatu/talkatu/talkatulinkdialog.h to /usr/include/talkatu-1.0/talkatu
23-Jan-2019 23:44:05 2019-01-23 18:44:05.876 default/stage-0/default-step-0-0: Installing /workspace/talkatu/talkatu/talkatumarkdownbuffer.h to /usr/include/talkatu-1.0/talkatu
23-Jan-2019 23:44:05 2019-01-23 18:44:05.876 default/stage-0/default-step-0-0: Installing /workspace/talkatu/talkatu/talkatumarkup.h to /usr/include/talkatu-1.0/talkatu
23-Jan-2019 23:44:05 2019-01-23 18:44:05.876 default/stage-0/default-step-0-0: Installing /workspace/talkatu/talkatu/talkatumenutoolbutton.h to /usr/include/talkatu-1.0/talkatu
23-Jan-2019 23:44:05 2019-01-23 18:44:05.876 default/stage-0/default-step-0-0: Installing /workspace/talkatu/talkatu/talkatumessage.h to /usr/include/talkatu-1.0/talkatu
23-Jan-2019 23:44:05 2019-01-23 18:44:05.876 default/stage-0/default-step-0-0: Installing /workspace/talkatu/talkatu/talkatumessageactions.h to /usr/include/talkatu-1.0/talkatu
23-Jan-2019 23:44:05 2019-01-23 18:44:05.876 default/stage-0/default-step-0-0: Installing /workspace/talkatu/talkatu/talkatutag.h to /usr/include/talkatu-1.0/talkatu
23-Jan-2019 23:44:05 2019-01-23 18:44:05.876 default/stage-0/default-step-0-0: Installing /workspace/talkatu/talkatu/talkatutagtable.h to /usr/include/talkatu-1.0/talkatu
23-Jan-2019 23:44:05 2019-01-23 18:44:05.876 default/stage-0/default-step-0-0: Installing /workspace/talkatu/talkatu/talkatutoolbar.h to /usr/include/talkatu-1.0/talkatu
23-Jan-2019 23:44:05 2019-01-23 18:44:05.876 default/stage-0/default-step-0-0: Installing /workspace/talkatu/talkatu/talkatutooldrawer.h to /usr/include/talkatu-1.0/talkatu
23-Jan-2019 23:44:05 2019-01-23 18:44:05.876 default/stage-0/default-step-0-0: Installing /workspace/talkatu/talkatu/talkatuview.h to /usr/include/talkatu-1.0/talkatu
23-Jan-2019 23:44:05 2019-01-23 18:44:05.876 default/stage-0/default-step-0-0: Installing /workspace/talkatu/talkatu/talkatuwholebuffer.h to /usr/include/talkatu-1.0/talkatu
23-Jan-2019 23:44:05 2019-01-23 18:44:05.876 default/stage-0/default-step-0-0: Installing /workspace/talkatu/build/talkatu/talkatuversion.h to /usr/include/talkatu-1.0/talkatu
23-Jan-2019 23:44:05 2019-01-23 18:44:05.876 default/stage-0/default-step-0-0: Installing /workspace/talkatu/build/talkatu/talkatu.h to /usr/include/talkatu-1.0
23-Jan-2019 23:44:05 2019-01-23 18:44:05.876 default/stage-0/default-step-0-0: Installing /workspace/talkatu/build/meson-private/talkatu.pc to /usr/lib/x86_64-linux-gnu/pkgconfig
23-Jan-2019 23:44:05 2019-01-23 18:44:05.876 default/stage-0/default-step-0-0: Installing /workspace/talkatu/talkatu/talkatu.xml to /usr/share/glade/catalogs
23-Jan-2019 23:44:05 2019-01-23 18:44:05.876 default/stage-0/default-step-0-0: Installing /workspace/talkatu/ChangeLog to /usr/share/doc/talkatu
23-Jan-2019 23:44:05 2019-01-23 18:44:05.876 default/stage-0/default-step-0-0: Installing /workspace/talkatu/INSTALL to /usr/share/doc/talkatu
23-Jan-2019 23:44:05 2019-01-23 18:44:05.876 default/stage-0/default-step-0-0: Installing /workspace/talkatu/README.md to /usr/share/doc/talkatu
23-Jan-2019 23:44:05 2019-01-23 18:44:05.876 default/stage-0/default-step-0-0: Installing /workspace/talkatu/HACKING to /usr/share/doc/talkatu
23-Jan-2019 23:44:05 2019-01-23 18:44:05.876 default/stage-0/default-step-0-0: Installing /workspace/talkatu/logo.png to /usr/share/doc/talkatu
23-Jan-2019 23:44:05 2019-01-23 18:44:05.876 default/stage-0/default-step-0-0: Running custom install script '/usr/bin/python3 /usr/bin/meson --internal gtkdoc --sourcedir=/workspace/talkatu --builddir=/workspace/talkatu/build --subdir=talkatu/reference --headerdirs=/workspace/talkatu/talkatu/.@@/workspace/talkatu/build/talkatu/. --mainfile=talkatu-docs.xml --modulename=talkatu --mode=auto --scanargs=--rebuild-types@@--rebuild-sections@@--ignore-headers=talkatu.h talkatuenums.h talkaturesources.h --gobjects-types-file=/workspace/talkatu/talkatu/reference/talkatu.types --mkdbargs=--ignore-files=talkatu.h talkatuenums.h talkaturesources.h --content-files= --cflags=-I/workspace/talkatu/build/. -I/workspace/talkatu/. -I/workspace/talkatu/build/talkatu/. -I/workspace/talkatu/talkatu/. -I/usr/include/glib-2.0 -I/usr/lib/x86_64-linux-gnu/glib-2.0/include -pthread -I/usr/include/gtk-3.0 -I/usr/include/at-spi2-atk/2.0 -I/usr/include/at-spi-2.0 -I/usr/include/dbus-1.0 -I/usr/lib/x86_64-linux-gnu/dbus-1.0/include -I/usr/include/gio-unix-2.0/ -I/usr/include/cairo -I/usr/include/pango-1.0 -I/usr/include/harfbuzz -I/usr/include/fribidi -I/usr/include/atk-1.0 -I/usr/include/pixman-1 -I/usr/include/uuid -I/usr/include/freetype2 -I/usr/include/libpng16 -I/usr/include/gdk-pixbuf-2.0 -I/usr/include/gspell-1 -I/usr/include/enchant --ldflags=-L/workspace/talkatu/build/talkatu -Wl,-rpath,/workspace/talkatu/build/talkatu -ltalkatu -lcmark -lglib-2.0 -lgobject-2.0 -lgumbo -lgtk-3 -lgdk-3 -lpangocairo-1.0 -lpango-1.0 -latk-1.0 -lcairo-gobject -lcairo -lgdk_pixbuf-2.0 -lgio-2.0 -lgspell-1 -lenchant --cc=cc --ld=cc'
23-Jan-2019 23:44:05 2019-01-23 18:44:05.876 default/stage-0/default-step-0-0: Running custom install script '/usr/bin/python3 /usr/bin/meson --internal gettext install --subdir=po --localedir=share/locale --pkgname=talkatu'
23-Jan-2019 23:44:05 2019-01-23 18:44:05.920 default/stage-0/default-step-0-0: + hg clone https://bitbucket.org/pidgin/libgnt
23-Jan-2019 23:44:07 2019-01-23 18:44:07.749 default/stage-0/default-step-0-0: destination directory: libgnt
23-Jan-2019 23:44:07 2019-01-23 18:44:07.749 default/stage-0/default-step-0-0: requesting all changes
23-Jan-2019 23:44:07 2019-01-23 18:44:07.749 default/stage-0/default-step-0-0: adding changesets
23-Jan-2019 23:44:07 2019-01-23 18:44:07.749 default/stage-0/default-step-0-0: adding manifests
23-Jan-2019 23:44:07 2019-01-23 18:44:07.749 default/stage-0/default-step-0-0: adding file changes
23-Jan-2019 23:44:07 2019-01-23 18:44:07.749 default/stage-0/default-step-0-0: added 1081 changesets with 2862 changes to 117 files (+1 heads)
23-Jan-2019 23:44:07 2019-01-23 18:44:07.886 default/stage-0/default-step-0-0: new changesets 1e560a4fa6ac:3cb435985468
23-Jan-2019 23:44:07 2019-01-23 18:44:07.886 default/stage-0/default-step-0-0: updating to branch default
23-Jan-2019 23:44:07 2019-01-23 18:44:07.886 default/stage-0/default-step-0-0: 81 files updated, 0 files merged, 0 files removed, 0 files unresolved
23-Jan-2019 23:44:07 2019-01-23 18:44:07.921 default/stage-0/default-step-0-0: + meson -Dprefix=/usr libgnt libgnt/build
23-Jan-2019 23:44:09 2019-01-23 18:44:09.546 default/stage-0/default-step-0-0: The Meson build system
23-Jan-2019 23:44:09 2019-01-23 18:44:09.546 default/stage-0/default-step-0-0: Version: 0.47.2
23-Jan-2019 23:44:09 2019-01-23 18:44:09.546 default/stage-0/default-step-0-0: Source dir: /workspace/libgnt
23-Jan-2019 23:44:09 2019-01-23 18:44:09.546 default/stage-0/default-step-0-0: Build dir: /workspace/libgnt/build
23-Jan-2019 23:44:09 2019-01-23 18:44:09.546 default/stage-0/default-step-0-0: Build type: native build
23-Jan-2019 23:44:09 2019-01-23 18:44:09.546 default/stage-0/default-step-0-0: Project name: libgnt
23-Jan-2019 23:44:09 2019-01-23 18:44:09.546 default/stage-0/default-step-0-0: Project version: 2.9.0-devel
23-Jan-2019 23:44:09 2019-01-23 18:44:09.546 default/stage-0/default-step-0-0: Native C compiler: cc (gcc 8.2.0 "cc (Debian 8.2.0-6) 8.2.0")
23-Jan-2019 23:44:09 2019-01-23 18:44:09.546 default/stage-0/default-step-0-0: Build machine cpu family: x86_64
23-Jan-2019 23:44:09 2019-01-23 18:44:09.546 default/stage-0/default-step-0-0: Build machine cpu: x86_64
23-Jan-2019 23:44:09 2019-01-23 18:44:09.546 default/stage-0/default-step-0-0: Found pkg-config: /usr/bin/pkg-config (0.29)
23-Jan-2019 23:44:09 2019-01-23 18:44:09.546 default/stage-0/default-step-0-0: Native dependency glib-2.0 found: YES 2.56.1
23-Jan-2019 23:44:09 2019-01-23 18:44:09.546 default/stage-0/default-step-0-0: Native dependency gobject-2.0 found: YES 2.56.1
23-Jan-2019 23:44:09 2019-01-23 18:44:09.546 default/stage-0/default-step-0-0: Native dependency libxml-2.0 found: YES 2.9.4
23-Jan-2019 23:44:09 2019-01-23 18:44:09.546 default/stage-0/default-step-0-0: Native dependency ncursesw found: YES 6.1.20180714
23-Jan-2019 23:44:09 2019-01-23 18:44:09.546 default/stage-0/default-step-0-0: Native dependency panelw found: YES 6.1.20180714
23-Jan-2019 23:44:09 2019-01-23 18:44:09.546 default/stage-0/default-step-0-0: Header <ncurses.h> has symbol "get_wch": YES
23-Jan-2019 23:44:09 2019-01-23 18:44:09.546 default/stage-0/default-step-0-0: Header <ncursesw/ncurses.h> has symbol "get_wch": YES
23-Jan-2019 23:44:09 2019-01-23 18:44:09.546 default/stage-0/default-step-0-0: Native dependency python3 found: YES 3.6
23-Jan-2019 23:44:09 2019-01-23 18:44:09.546 default/stage-0/default-step-0-0: Configuring gntconfig.h using configuration
23-Jan-2019 23:44:09 2019-01-23 18:44:09.546 default/stage-0/default-step-0-0: Configuring gntversion.h using configuration
23-Jan-2019 23:44:09 2019-01-23 18:44:09.546 default/stage-0/default-step-0-0: Configuring gnt.h using configuration
23-Jan-2019 23:44:09 2019-01-23 18:44:09.546 default/stage-0/default-step-0-0: Native dependency gmodule-2.0 found: YES 2.56.1
23-Jan-2019 23:44:09 2019-01-23 18:44:09.546 default/stage-0/default-step-0-0: WARNING: Project targetting '>=0.37.0' but tried to use feature introduced in '0.41.0': variables arg in pkgconfig.generate
23-Jan-2019 23:44:09 2019-01-23 18:44:09.546 default/stage-0/default-step-0-0: WARNING: Project targetting '>=0.37.0' but tried to use feature introduced in '0.41.0': custom pkgconfig variables
23-Jan-2019 23:44:09 2019-01-23 18:44:09.546 default/stage-0/default-step-0-0: Native dependency gobject-introspection-1.0 found: YES 1.56.1
23-Jan-2019 23:44:09 2019-01-23 18:44:09.546 default/stage-0/default-step-0-0: WARNING: Project targetting '>=0.37.0' but tried to use feature introduced in '0.40.0': build_by_default arg in build target
23-Jan-2019 23:44:09 2019-01-23 18:44:09.546 default/stage-0/default-step-0-0: Configuring version.xml using configuration
23-Jan-2019 23:44:09 2019-01-23 18:44:09.546 default/stage-0/default-step-0-0: Build targets in project: 14
23-Jan-2019 23:44:09 2019-01-23 18:44:09.546 default/stage-0/default-step-0-0: WARNING: Project specifies a minimum meson_version '>=0.37.0' but uses features which were added in newer versions:
23-Jan-2019 23:44:09 2019-01-23 18:44:09.546 default/stage-0/default-step-0-0: * 0.40.0: {'build_by_default arg in build target'}
23-Jan-2019 23:44:09 2019-01-23 18:44:09.546 default/stage-0/default-step-0-0: * 0.41.0: {'custom pkgconfig variables', 'variables arg in pkgconfig.generate'}
23-Jan-2019 23:44:09 2019-01-23 18:44:09.546 default/stage-0/default-step-0-0: Found ninja-1.8.2 at /usr/bin/ninja
23-Jan-2019 23:44:09 2019-01-23 18:44:09.588 default/stage-0/default-step-0-0: + ninja -C libgnt/build install
23-Jan-2019 23:44:09 2019-01-23 18:44:09.593 default/stage-0/default-step-0-0: ninja: Entering directory `libgnt/build'
23-Jan-2019 23:44:09 2019-01-23 18:44:09.758 default/stage-0/default-step-0-0: [1/35] Compiling C object 'gnt@sha/gntclipboard.c.o'.
23-Jan-2019 23:44:09 2019-01-23 18:44:09.789 default/stage-0/default-step-0-0: [2/35] Compiling C object 'gnt@sha/gntlabel.c.o'.
23-Jan-2019 23:44:09 2019-01-23 18:44:09.792 default/stage-0/default-step-0-0: [3/35] Compiling C object 'gnt@sha/gntline.c.o'.
23-Jan-2019 23:44:09 2019-01-23 18:44:09.792 default/stage-0/default-step-0-0: [4/35] Compiling C object 'gnt@sha/gntbutton.c.o'.
23-Jan-2019 23:44:09 2019-01-23 18:44:09.793 default/stage-0/default-step-0-0: [5/35] Compiling C object 'gnt@sha/gntmenuitem.c.o'.
23-Jan-2019 23:44:09 2019-01-23 18:44:09.796 default/stage-0/default-step-0-0: [6/35] Compiling C object 'gnt@sha/gntmenuitemcheck.c.o'.
23-Jan-2019 23:44:09 2019-01-23 18:44:09.800 default/stage-0/default-step-0-0: [7/35] Compiling C object 'gnt@sha/gntprogressbar.c.o'.
23-Jan-2019 23:44:09 2019-01-23 18:44:09.819 default/stage-0/default-step-0-0: [8/35] Compiling C object 'gnt@sha/gntcheckbox.c.o'.
23-Jan-2019 23:44:09 2019-01-23 18:44:09.842 default/stage-0/default-step-0-0: [9/35] Compiling C object 'gnt@sha/gntbindable.c.o'.
23-Jan-2019 23:44:09 2019-01-23 18:44:09.847 default/stage-0/default-step-0-0: [10/35] Compiling C object 'gnt@sha/gntmenu.c.o'.
23-Jan-2019 23:44:09 2019-01-23 18:44:09.864 default/stage-0/default-step-0-0: [11/35] Compiling C object 'gnt@sha/gntcombobox.c.o'.
23-Jan-2019 23:44:09 2019-01-23 18:44:09.866 default/stage-0/default-step-0-0: [12/35] Compiling C object 'gnt@sha/gntcolors.c.o'.
23-Jan-2019 23:44:09 2019-01-23 18:44:09.866 default/stage-0/default-step-0-0: [13/35] Compiling C object 'gnt@sha/gntkeys.c.o'.
23-Jan-2019 23:44:09 2019-01-23 18:44:09.891 default/stage-0/default-step-0-0: [14/35] Compiling C object 'gnt@sha/gntbox.c.o'.
23-Jan-2019 23:44:09 2019-01-23 18:44:09.921 default/stage-0/default-step-0-0: [15/35] Compiling C object 'gnt@sha/gntwidget.c.o'.
23-Jan-2019 23:44:09 2019-01-23 18:44:09.933 default/stage-0/default-step-0-0: [16/35] Compiling C object 'gnt@sha/gntslider.c.o'.
23-Jan-2019 23:44:09 2019-01-23 18:44:09.944 default/stage-0/default-step-0-0: [17/35] Compiling C object 'gnt@sha/gntentry.c.o'.
23-Jan-2019 23:44:09 2019-01-23 18:44:09.952 default/stage-0/default-step-0-0: [18/35] Compiling C object 'gnt@sha/gntfilesel.c.o'.
23-Jan-2019 23:44:09 2019-01-23 18:44:09.996 default/stage-0/default-step-0-0: [19/35] Compiling C object 'gnt@sha/gntwindow.c.o'.
23-Jan-2019 23:44:09 2019-01-23 18:44:09.997 default/stage-0/default-step-0-0: [20/35] Compiling C object 'gnt@sha/gntstyle.c.o'.
23-Jan-2019 23:44:10 2019-01-23 18:44:10.038 default/stage-0/default-step-0-0: [21/35] Compiling C object 'gnt@sha/gntws.c.o'.
23-Jan-2019 23:44:10 2019-01-23 18:44:10.061 default/stage-0/default-step-0-0: [22/35] Compiling C object 'wms/wms@@s@sha/s.c.o'.
23-Jan-2019 23:44:10 2019-01-23 18:44:10.063 default/stage-0/default-step-0-0: [23/35] Compiling C object 'wms/wms@@irssi@sha/irssi.c.o'.
23-Jan-2019 23:44:10 2019-01-23 18:44:10.071 default/stage-0/default-step-0-0: [24/35] Compiling C object 'gnt@sha/gntutils.c.o'.
23-Jan-2019 23:44:10 2019-01-23 18:44:10.082 default/stage-0/default-step-0-0: [25/35] Compiling C object 'gnt@sha/gnttextview.c.o'.
23-Jan-2019 23:44:10 2019-01-23 18:44:10.097 default/stage-0/default-step-0-0: [26/35] Compiling C object 'gnt@sha/gntmain.c.o'.
23-Jan-2019 23:44:10 2019-01-23 18:44:10.231 default/stage-0/default-step-0-0: [27/35] Compiling C object 'gnt@sha/gnttree.c.o'.
23-Jan-2019 23:44:10 2019-01-23 18:44:10.315 default/stage-0/default-step-0-0: [28/35] Compiling C object 'gnt@sha/gntwm.c.o'.
23-Jan-2019 23:44:10 2019-01-23 18:44:10.466 default/stage-0/default-step-0-0: [29/35] Linking target libgnt.so.1.9.0.
23-Jan-2019 23:44:10 2019-01-23 18:44:10.778 default/stage-0/default-step-0-0: [30/35] Generating symbol file 'gnt@sha/libgnt.so.1.9.0.symbols'.
23-Jan-2019 23:44:10 2019-01-23 18:44:10.852 default/stage-0/default-step-0-0: [31/35] Linking target wms/s.so.
23-Jan-2019 23:44:10 2019-01-23 18:44:10.853 default/stage-0/default-step-0-0: [32/35] Linking target wms/irssi.so.
23-Jan-2019 23:44:12 2019-01-23 18:44:12.314 default/stage-0/default-step-0-0: [33/35] Generating Gnt-2.9.gir with a custom command.
23-Jan-2019 23:44:12 2019-01-23 18:44:12.314 default/stage-0/default-step-0-0: /workspace/libgnt/gntwidget.h:106: syntax error, unexpected identifier in ' WINDOW *window;' at 'WINDOW'
23-Jan-2019 23:44:12 2019-01-23 18:44:12.314 default/stage-0/default-step-0-0: /workspace/libgnt/gntwidget.h:113: syntax error, unexpected '}' in '};' at '}'
23-Jan-2019 23:44:12 2019-01-23 18:44:12.314 default/stage-0/default-step-0-0: gnttextview.h:154: Warning: Gnt: gnt_text_format_flag_to_chtype: return value: Unresolved type: 'chtype'
23-Jan-2019 23:44:12 2019-01-23 18:44:12.532 default/stage-0/default-step-0-0: [34/35] Generating Gnt-2.9.typelib with a custom command.
23-Jan-2019 23:44:12 2019-01-23 18:44:12.532 default/stage-0/default-step-0-0: [34/35] Installing files.
23-Jan-2019 23:44:23 2019-01-23 18:44:23.857 default/stage-0/default-step-0-0: Building documentation for libgnt
23-Jan-2019 23:44:23 2019-01-23 18:44:23.857 default/stage-0/default-step-0-0: /workspace/libgnt/build/./gnt.h:97: warning: Parameter description for gnt_screen_occupy::widget is missing in source code comment block.
23-Jan-2019 23:44:23 2019-01-23 18:44:23.857 default/stage-0/default-step-0-0: /workspace/libgnt/build/./gnt.h:105: warning: Parameter description for gnt_screen_release::widget is missing in source code comment block.
23-Jan-2019 23:44:23 2019-01-23 18:44:23.857 default/stage-0/default-step-0-0: /workspace/libgnt/build/./gnt.h:113: warning: Parameter description for gnt_screen_update::widget is missing in source code comment block.
23-Jan-2019 23:44:23 2019-01-23 18:44:23.857 default/stage-0/default-step-0-0: unknown:0: warning: Field descriptions for struct GntBindableAction are missing in source code comment block.
23-Jan-2019 23:44:23 2019-01-23 18:44:23.857 default/stage-0/default-step-0-0: unknown:0: warning: Field descriptions for struct GntBindableActionParam are missing in source code comment block.
23-Jan-2019 23:44:23 2019-01-23 18:44:23.857 default/stage-0/default-step-0-0: /workspace/libgnt/./gntbindable.h:129: warning: Parameter description for gnt_bindable_class_register_action::... is missing in source code comment block.
23-Jan-2019 23:44:23 2019-01-23 18:44:23.857 default/stage-0/default-step-0-0: /workspace/libgnt/./gntbindable.h:139: warning: Parameter description for gnt_bindable_register_binding::... is missing in source code comment block.
23-Jan-2019 23:44:23 2019-01-23 18:44:23.857 default/stage-0/default-step-0-0: /workspace/libgnt/./gntbindable.h:172: warning: Parameter description for gnt_bindable_perform_action_named::... is missing in source code comment block.
23-Jan-2019 23:44:23 2019-01-23 18:44:23.857 default/stage-0/default-step-0-0: unknown:0: warning: Value descriptions for GntAlignment are missing in source code comment block.
23-Jan-2019 23:44:23 2019-01-23 18:44:23.857 default/stage-0/default-step-0-0: unknown:0: warning: Field descriptions for struct GntButtonPriv are missing in source code comment block.
23-Jan-2019 23:44:23 2019-01-23 18:44:23.857 default/stage-0/default-step-0-0: /workspace/libgnt/./gntcolors.h:38: warning: Value descriptions for GntColorType are missing in source code comment block.
23-Jan-2019 23:44:23 2019-01-23 18:44:23.857 default/stage-0/default-step-0-0: unknown:0: warning: Value descriptions for GntEntryFlag are missing in source code comment block.
23-Jan-2019 23:44:23 2019-01-23 18:44:23.857 default/stage-0/default-step-0-0: unknown:0: warning: Value descriptions for GntFileType are missing in source code comment block.
23-Jan-2019 23:44:23 2019-01-23 18:44:23.857 default/stage-0/default-step-0-0: unknown:0: warning: Field descriptions for struct GntMenuItemPriv are missing in source code comment block.
23-Jan-2019 23:44:23 2019-01-23 18:44:23.857 default/stage-0/default-step-0-0: unknown:0: warning: Value descriptions for GntProgressBarOrientation are missing in source code comment block.
23-Jan-2019 23:44:23 2019-01-23 18:44:23.857 default/stage-0/default-step-0-0: unknown:0: warning: Value descriptions for GntStyle are missing in source code comment block.
23-Jan-2019 23:44:23 2019-01-23 18:44:23.857 default/stage-0/default-step-0-0: /workspace/libgnt/./gntstyle.h:136: warning: Parameter description for gnt_styles_get_keyremaps::type is missing in source code comment block.
23-Jan-2019 23:44:23 2019-01-23 18:44:23.857 default/stage-0/default-step-0-0: /workspace/libgnt/./gntstyle.h:136: warning: Parameter description for gnt_styles_get_keyremaps::hash is missing in source code comment block.
23-Jan-2019 23:44:23 2019-01-23 18:44:23.857 default/stage-0/default-step-0-0: /workspace/libgnt/./gntstyle.h:143: warning: Parameter description for gnt_style_read_actions::type is missing in source code comment block.
23-Jan-2019 23:44:23 2019-01-23 18:44:23.857 default/stage-0/default-step-0-0: /workspace/libgnt/./gntstyle.h:143: warning: Parameter description for gnt_style_read_actions::klass is missing in source code comment block.
23-Jan-2019 23:44:23 2019-01-23 18:44:23.857 default/stage-0/default-step-0-0: /workspace/libgnt/./gntstyle.h:163: warning: Parameter description for gnt_style_read_workspaces::wm is missing in source code comment block.
23-Jan-2019 23:44:23 2019-01-23 18:44:23.857 default/stage-0/default-step-0-0: unknown:0: warning: Value descriptions for GntTextViewFlag are missing in source code comment block.
23-Jan-2019 23:44:23 2019-01-23 18:44:23.857 default/stage-0/default-step-0-0: unknown:0: warning: Value descriptions for GntTextFormatFlags are missing in source code comment block.
23-Jan-2019 23:44:23 2019-01-23 18:44:23.857 default/stage-0/default-step-0-0: unknown:0: warning: Value descriptions for GntTreeColumnFlag are missing in source code comment block.
23-Jan-2019 23:44:23 2019-01-23 18:44:23.857 default/stage-0/default-step-0-0: unknown:0: warning: Field descriptions for struct GntTreeColInfo are missing in source code comment block.
23-Jan-2019 23:44:23 2019-01-23 18:44:23.857 default/stage-0/default-step-0-0: /workspace/libgnt/./gntutils.h:110: warning: Parameter description for gnt_boolean_handled_accumulator::ihint is missing in source code comment block.
23-Jan-2019 23:44:23 2019-01-23 18:44:23.857 default/stage-0/default-step-0-0: /workspace/libgnt/./gntutils.h:110: warning: Parameter description for gnt_boolean_handled_accumulator::return_accu is missing in source code comment block.
23-Jan-2019 23:44:23 2019-01-23 18:44:23.857 default/stage-0/default-step-0-0: /workspace/libgnt/./gntutils.h:110: warning: Parameter description for gnt_boolean_handled_accumulator::handler_return is missing in source code comment block.
23-Jan-2019 23:44:23 2019-01-23 18:44:23.857 default/stage-0/default-step-0-0: /workspace/libgnt/./gntutils.h:110: warning: Parameter description for gnt_boolean_handled_accumulator::dummy is missing in source code comment block.
23-Jan-2019 23:44:23 2019-01-23 18:44:23.857 default/stage-0/default-step-0-0: /workspace/libgnt/./gntutils.h:140: warning: Parameter description for gnt_util_parse_widgets::... is missing in source code comment block.
23-Jan-2019 23:44:23 2019-01-23 18:44:23.857 default/stage-0/default-step-0-0: unknown:0: warning: Value descriptions for GntWidgetFlags are missing in source code comment block.
23-Jan-2019 23:44:23 2019-01-23 18:44:23.857 default/stage-0/default-step-0-0: unknown:0: warning: Value descriptions for GntMouseEvent are missing in source code comment block.
23-Jan-2019 23:44:23 2019-01-23 18:44:23.857 default/stage-0/default-step-0-0: unknown:0: warning: Value descriptions for GntParamFlags are missing in source code comment block.
23-Jan-2019 23:44:23 2019-01-23 18:44:23.857 default/stage-0/default-step-0-0: unknown:0: warning: Field descriptions for struct GntWidgetPriv are missing in source code comment block.
23-Jan-2019 23:44:23 2019-01-23 18:44:23.857 default/stage-0/default-step-0-0: /workspace/libgnt/./gntwidget.h:186: warning: Parameter description for gnt_widget_expose::widget is missing in source code comment block.
23-Jan-2019 23:44:23 2019-01-23 18:44:23.857 default/stage-0/default-step-0-0: /workspace/libgnt/./gntwidget.h:186: warning: Parameter description for gnt_widget_expose::x is missing in source code comment block.
23-Jan-2019 23:44:23 2019-01-23 18:44:23.857 default/stage-0/default-step-0-0: /workspace/libgnt/./gntwidget.h:186: warning: Parameter description for gnt_widget_expose::y is missing in source code comment block.
23-Jan-2019 23:44:23 2019-01-23 18:44:23.857 default/stage-0/default-step-0-0: /workspace/libgnt/./gntwidget.h:186: warning: Parameter description for gnt_widget_expose::width is missing in source code comment block.
23-Jan-2019 23:44:23 2019-01-23 18:44:23.857 default/stage-0/default-step-0-0: /workspace/libgnt/./gntwidget.h:186: warning: Parameter description for gnt_widget_expose::height is missing in source code comment block.
23-Jan-2019 23:44:23 2019-01-23 18:44:23.857 default/stage-0/default-step-0-0: /workspace/libgnt/./gntwidget.h:327: warning: Parameter description for gnt_widget_queue_update::widget is missing in source code comment block.
23-Jan-2019 23:44:23 2019-01-23 18:44:23.857 default/stage-0/default-step-0-0: unknown:0: warning: Value descriptions for GntWindowFlags are missing in source code comment block.
23-Jan-2019 23:44:23 2019-01-23 18:44:23.857 default/stage-0/default-step-0-0: unknown:0: warning: Value descriptions for GntKeyPressMode are missing in source code comment block.
23-Jan-2019 23:44:23 2019-01-23 18:44:23.857 default/stage-0/default-step-0-0: unknown:0: warning: Field descriptions for struct GntNode are missing in source code comment block.
23-Jan-2019 23:44:23 2019-01-23 18:44:23.857 default/stage-0/default-step-0-0: unknown:0: warning: Field descriptions for struct GntListWindow are missing in source code comment block.
23-Jan-2019 23:44:23 2019-01-23 18:44:23.857 default/stage-0/default-step-0-0: /workspace/libgnt/./gntwm.h:100: warning: Field description for GntWM::loop is missing in source code comment block.
23-Jan-2019 23:44:23 2019-01-23 18:44:23.857 default/stage-0/default-step-0-0: /workspace/libgnt/./gntwm.h:100: warning: Field description for GntWM::workspaces is missing in source code comment block.
23-Jan-2019 23:44:23 2019-01-23 18:44:23.857 default/stage-0/default-step-0-0: /workspace/libgnt/./gntwm.h:100: warning: Field description for GntWM::tagged is missing in source code comment block.
23-Jan-2019 23:44:23 2019-01-23 18:44:23.857 default/stage-0/default-step-0-0: /workspace/libgnt/./gntwm.h:100: warning: Field description for GntWM::cws is missing in source code comment block.
23-Jan-2019 23:44:23 2019-01-23 18:44:23.857 default/stage-0/default-step-0-0: /workspace/libgnt/./gntwm.h:100: warning: Field description for GntWM::_list is missing in source code comment block.
23-Jan-2019 23:44:23 2019-01-23 18:44:23.857 default/stage-0/default-step-0-0: /workspace/libgnt/./gntwm.h:100: warning: Field description for GntWM::windows is missing in source code comment block.
23-Jan-2019 23:44:23 2019-01-23 18:44:23.857 default/stage-0/default-step-0-0: /workspace/libgnt/./gntwm.h:100: warning: Field description for GntWM::actions is missing in source code comment block.
23-Jan-2019 23:44:23 2019-01-23 18:44:23.857 default/stage-0/default-step-0-0: /workspace/libgnt/./gntwm.h:100: warning: Field description for GntWM::nodes is missing in source code comment block.
23-Jan-2019 23:44:23 2019-01-23 18:44:23.857 default/stage-0/default-step-0-0: /workspace/libgnt/./gntwm.h:100: warning: Field description for GntWM::name_places is missing in source code comment block.
23-Jan-2019 23:44:23 2019-01-23 18:44:23.857 default/stage-0/default-step-0-0: /workspace/libgnt/./gntwm.h:100: warning: Field description for GntWM::title_places is missing in source code comment block.
23-Jan-2019 23:44:23 2019-01-23 18:44:23.857 default/stage-0/default-step-0-0: /workspace/libgnt/./gntwm.h:100: warning: Field description for GntWM::mode is missing in source code comment block.
23-Jan-2019 23:44:23 2019-01-23 18:44:23.857 default/stage-0/default-step-0-0: /workspace/libgnt/./gntwm.h:100: warning: Field description for GntWM::positions is missing in source code comment block.
23-Jan-2019 23:44:23 2019-01-23 18:44:23.857 default/stage-0/default-step-0-0: /workspace/libgnt/./gntwm.h:365: warning: Parameter description for gnt_wm_set_event_stack::wm is missing in source code comment block.
23-Jan-2019 23:44:23 2019-01-23 18:44:23.857 default/stage-0/default-step-0-0: /workspace/libgnt/./gntwm.h:365: warning: Parameter description for gnt_wm_set_event_stack::set is missing in source code comment block.
23-Jan-2019 23:44:23 2019-01-23 18:44:23.857 default/stage-0/default-step-0-0: /workspace/libgnt/./gntwm.h:372: warning: Parameter description for gnt_wm_copy_win::widget is missing in source code comment block.
23-Jan-2019 23:44:23 2019-01-23 18:44:23.857 default/stage-0/default-step-0-0: /workspace/libgnt/./gntwm.h:372: warning: Parameter description for gnt_wm_copy_win::node is missing in source code comment block.
23-Jan-2019 23:44:23 2019-01-23 18:44:23.857 default/stage-0/default-step-0-0: ./libgnt-unused.txt:1: warning: 20 unused declarations. They should be added to libgnt-sections.txt in the appropriate place.
23-Jan-2019 23:44:23 2019-01-23 18:44:23.857 default/stage-0/default-step-0-0:
23-Jan-2019 23:44:23 2019-01-23 18:44:23.857 default/stage-0/default-step-0-0: Warning: multiple "IDs" for constraint linkend: api-index-2.8.0.
23-Jan-2019 23:44:23 2019-01-23 18:44:23.857 default/stage-0/default-step-0-0: Warning: multiple "IDs" for constraint linkend: api-index-2.0.0.
23-Jan-2019 23:44:23 2019-01-23 18:44:23.857 default/stage-0/default-step-0-0: Warning: multiple "IDs" for constraint linkend: api-index-2.8.0.
23-Jan-2019 23:44:23 2019-01-23 18:44:23.857 default/stage-0/default-step-0-0: Warning: multiple "IDs" for constraint linkend: api-index-2.4.0.
23-Jan-2019 23:44:23 2019-01-23 18:44:23.857 default/stage-0/default-step-0-0: Warning: multiple "IDs" for constraint linkend: api-index-2.3.0.
23-Jan-2019 23:44:23 2019-01-23 18:44:23.857 default/stage-0/default-step-0-0: Warning: multiple "IDs" for constraint linkend: api-index-2.4.0.
23-Jan-2019 23:44:23 2019-01-23 18:44:23.857 default/stage-0/default-step-0-0: Warning: multiple "IDs" for constraint linkend: api-index-2.3.0.
23-Jan-2019 23:44:23 2019-01-23 18:44:23.857 default/stage-0/default-step-0-0: Warning: multiple "IDs" for constraint linkend: api-index-2.3.0.
23-Jan-2019 23:44:23 2019-01-23 18:44:23.857 default/stage-0/default-step-0-0: Warning: multiple "IDs" for constraint linkend: api-index-2.3.0.
23-Jan-2019 23:44:23 2019-01-23 18:44:23.857 default/stage-0/default-step-0-0: Warning: multiple "IDs" for constraint linkend: api-index-2.3.0.
23-Jan-2019 23:44:23 2019-01-23 18:44:23.857 default/stage-0/default-step-0-0: Warning: multiple "IDs" for constraint linkend: api-index-2.3.0.
23-Jan-2019 23:44:23 2019-01-23 18:44:23.857 default/stage-0/default-step-0-0: Warning: multiple "IDs" for constraint linkend: api-index-2.8.0.
23-Jan-2019 23:44:23 2019-01-23 18:44:23.857 default/stage-0/default-step-0-0: Warning: multiple "IDs" for constraint linkend: api-index-2.8.0.
23-Jan-2019 23:44:23 2019-01-23 18:44:23.857 default/stage-0/default-step-0-0: Warning: multiple "IDs" for constraint linkend: api-index-2.8.0.
23-Jan-2019 23:44:23 2019-01-23 18:44:23.857 default/stage-0/default-step-0-0: Warning: multiple "IDs" for constraint linkend: api-index-2.0.0.
23-Jan-2019 23:44:23 2019-01-23 18:44:23.857 default/stage-0/default-step-0-0: Warning: multiple "IDs" for constraint linkend: api-index-2.0.0.
23-Jan-2019 23:44:23 2019-01-23 18:44:23.857 default/stage-0/default-step-0-0: Warning: multiple "IDs" for constraint linkend: api-index-2.0.0.
23-Jan-2019 23:44:23 2019-01-23 18:44:23.857 default/stage-0/default-step-0-0: Warning: multiple "IDs" for constraint linkend: api-index-2.2.0.
23-Jan-2019 23:44:23 2019-01-23 18:44:23.857 default/stage-0/default-step-0-0: Warning: multiple "IDs" for constraint linkend: api-index-2.2.0.
23-Jan-2019 23:44:23 2019-01-23 18:44:23.857 default/stage-0/default-step-0-0: Warning: multiple "IDs" for constraint linkend: api-index-2.0.0.
23-Jan-2019 23:44:23 2019-01-23 18:44:23.857 default/stage-0/default-step-0-0: Warning: multiple "IDs" for constraint linkend: api-index-2.0.0.
23-Jan-2019 23:44:23 2019-01-23 18:44:23.857 default/stage-0/default-step-0-0: Warning: multiple "IDs" for constraint linkend: api-index-2.0.0.
23-Jan-2019 23:44:23 2019-01-23 18:44:23.857 default/stage-0/default-step-0-0: Warning: multiple "IDs" for constraint linkend: api-index-2.0.0.
23-Jan-2019 23:44:23 2019-01-23 18:44:23.857 default/stage-0/default-step-0-0: Warning: multiple "IDs" for constraint linkend: api-index-2.0.0.
23-Jan-2019 23:44:23 2019-01-23 18:44:23.857 default/stage-0/default-step-0-0: Warning: multiple "IDs" for constraint linkend: api-index-2.4.0.
23-Jan-2019 23:44:23 2019-01-23 18:44:23.857 default/stage-0/default-step-0-0: Warning: multiple "IDs" for constraint linkend: api-index-2.4.0.
23-Jan-2019 23:44:23 2019-01-23 18:44:23.857 default/stage-0/default-step-0-0: Warning: multiple "IDs" for constraint linkend: api-index-2.0.0.
23-Jan-2019 23:44:23 2019-01-23 18:44:23.857 default/stage-0/default-step-0-0: Warning: multiple "IDs" for constraint linkend: api-index-2.0.0.
23-Jan-2019 23:44:23 2019-01-23 18:44:23.857 default/stage-0/default-step-0-0: Warning: multiple "IDs" for constraint linkend: api-index-2.8.0.
23-Jan-2019 23:44:23 2019-01-23 18:44:23.857 default/stage-0/default-step-0-0: Warning: multiple "IDs" for constraint linkend: api-index-2.8.0.
23-Jan-2019 23:44:23 2019-01-23 18:44:23.857 default/stage-0/default-step-0-0: Warning: multiple "IDs" for constraint linkend: api-index-2.8.0.
23-Jan-2019 23:44:23 2019-01-23 18:44:23.857 default/stage-0/default-step-0-0: Warning: multiple "IDs" for constraint linkend: api-index-2.8.0.
23-Jan-2019 23:44:23 2019-01-23 18:44:23.857 default/stage-0/default-step-0-0: Warning: multiple "IDs" for constraint linkend: api-index-2.8.0.
23-Jan-2019 23:44:23 2019-01-23 18:44:23.857 default/stage-0/default-step-0-0: Warning: multiple "IDs" for constraint linkend: api-index-2.4.0.
23-Jan-2019 23:44:23 2019-01-23 18:44:23.857 default/stage-0/default-step-0-0: Warning: multiple "IDs" for constraint linkend: api-index-2.0.0.
23-Jan-2019 23:44:23 2019-01-23 18:44:23.857 default/stage-0/default-step-0-0: Warning: multiple "IDs" for constraint linkend: api-index-2.0.0.
23-Jan-2019 23:44:23 2019-01-23 18:44:23.857 default/stage-0/default-step-0-0: Warning: multiple "IDs" for constraint linkend: api-index-2.0.0.
23-Jan-2019 23:44:23 2019-01-23 18:44:23.857 default/stage-0/default-step-0-0: Warning: multiple "IDs" for constraint linkend: api-index-2.0.0.
23-Jan-2019 23:44:23 2019-01-23 18:44:23.858 default/stage-0/default-step-0-0: Warning: multiple "IDs" for constraint linkend: api-index-2.0.0.
23-Jan-2019 23:44:23 2019-01-23 18:44:23.858 default/stage-0/default-step-0-0: Warning: multiple "IDs" for constraint linkend: api-index-2.0.0.
23-Jan-2019 23:44:23 2019-01-23 18:44:23.858 default/stage-0/default-step-0-0: Warning: multiple "IDs" for constraint linkend: api-index-2.0.0.
23-Jan-2019 23:44:23 2019-01-23 18:44:23.858 default/stage-0/default-step-0-0: Warning: multiple "IDs" for constraint linkend: api-index-2.4.0.
23-Jan-2019 23:44:23 2019-01-23 18:44:23.858 default/stage-0/default-step-0-0: Warning: multiple "IDs" for constraint linkend: api-index-2.3.0.
23-Jan-2019 23:44:23 2019-01-23 18:44:23.858 default/stage-0/default-step-0-0: Warning: multiple "IDs" for constraint linkend: api-index-2.3.0.
23-Jan-2019 23:44:23 2019-01-23 18:44:23.858 default/stage-0/default-step-0-0: Warning: multiple "IDs" for constraint linkend: api-index-2.3.0.
23-Jan-2019 23:44:23 2019-01-23 18:44:23.858 default/stage-0/default-step-0-0: Warning: multiple "IDs" for constraint linkend: api-index-2.0.0.
23-Jan-2019 23:44:23 2019-01-23 18:44:23.858 default/stage-0/default-step-0-0: Warning: multiple "IDs" for constraint linkend: api-index-2.0.0.
23-Jan-2019 23:44:23 2019-01-23 18:44:23.858 default/stage-0/default-step-0-0: Warning: multiple "IDs" for constraint linkend: api-index-2.0.0.
23-Jan-2019 23:44:23 2019-01-23 18:44:23.858 default/stage-0/default-step-0-0: Warning: multiple "IDs" for constraint linkend: api-index-2.0.0.
23-Jan-2019 23:44:23 2019-01-23 18:44:23.858 default/stage-0/default-step-0-0: Warning: multiple "IDs" for constraint linkend: api-index-2.0.0.
23-Jan-2019 23:44:23 2019-01-23 18:44:23.858 default/stage-0/default-step-0-0: Warning: multiple "IDs" for constraint linkend: api-index-2.0.0.
23-Jan-2019 23:44:23 2019-01-23 18:44:23.858 default/stage-0/default-step-0-0: Warning: multiple "IDs" for constraint linkend: api-index-2.0.0.
23-Jan-2019 23:44:23 2019-01-23 18:44:23.858 default/stage-0/default-step-0-0: Warning: multiple "IDs" for constraint linkend: api-index-2.0.0.
23-Jan-2019 23:44:23 2019-01-23 18:44:23.858 default/stage-0/default-step-0-0: Warning: multiple "IDs" for constraint linkend: api-index-2.0.0.
23-Jan-2019 23:44:23 2019-01-23 18:44:23.858 default/stage-0/default-step-0-0: Warning: multiple "IDs" for constraint linkend: api-index-2.0.0.
23-Jan-2019 23:44:23 2019-01-23 18:44:23.858 default/stage-0/default-step-0-0: Warning: multiple "IDs" for constraint linkend: api-index-2.2.0.
23-Jan-2019 23:44:23 2019-01-23 18:44:23.858 default/stage-0/default-step-0-0: Warning: multiple "IDs" for constraint linkend: api-index-2.0.0.
23-Jan-2019 23:44:24 2019-01-23 18:44:24.116 default/stage-0/default-step-0-0:
23-Jan-2019 23:44:24 2019-01-23 18:44:24.116 default/stage-0/default-step-0-0: html/api-index-full.html:435: warning: no link for: "GNT-EXTRA-VERSION:CAPS" -> (GNT_EXTRA_VERSION).
23-Jan-2019 23:44:24 2019-01-23 18:44:24.116 default/stage-0/default-step-0-0: html/api-index-full.html:435: warning: no link for: "libgnt-gntversion" -> (gntversion).
23-Jan-2019 23:44:24 2019-01-23 18:44:24.116 default/stage-0/default-step-0-0: html/api-index-full.html:878: warning: no link for: "GNT-MAJOR-VERSION:CAPS" -> (GNT_MAJOR_VERSION).
23-Jan-2019 23:44:24 2019-01-23 18:44:24.116 default/stage-0/default-step-0-0: html/api-index-full.html:1014: warning: no link for: "GNT-MICRO-VERSION:CAPS" -> (GNT_MICRO_VERSION).
23-Jan-2019 23:44:24 2019-01-23 18:44:24.116 default/stage-0/default-step-0-0: html/api-index-full.html:1018: warning: no link for: "GNT-MINOR-VERSION:CAPS" -> (GNT_MINOR_VERSION).
23-Jan-2019 23:44:24 2019-01-23 18:44:24.116 default/stage-0/default-step-0-0: html/api-index-full.html:1027: warning: no link for: "NCURSES-HEADER:CAPS" -> (NCURSES_HEADER).
23-Jan-2019 23:44:24 2019-01-23 18:44:24.116 default/stage-0/default-step-0-0: html/api-index-full.html:1027: warning: no link for: "libgnt-gntconfig" -> (gntconfig).
23-Jan-2019 23:44:24 2019-01-23 18:44:24.116 default/stage-0/default-step-0-0: html/api-index-full.html:1561: warning: no link for: "USE-PYTHON:CAPS" -> (USE_PYTHON).
23-Jan-2019 23:44:24 2019-01-23 18:44:24.116 default/stage-0/default-step-0-0: html/api-index-full.html:1598: warning: no link for: "GNT-VERSION:CAPS" -> (GNT_VERSION).
23-Jan-2019 23:44:24 2019-01-23 18:44:24.116 default/stage-0/default-step-0-0: html/libgnt-gnt.html:244: warning: no link for: "NULL:CAPS" -> (<code class="literal">NULL</code>).
23-Jan-2019 23:44:24 2019-01-23 18:44:24.116 default/stage-0/default-step-0-0: html/libgnt-gnt.html:277: warning: no link for: "FALSE:CAPS" -> (<code class="literal">FALSE</code>).
23-Jan-2019 23:44:24 2019-01-23 18:44:24.116 default/stage-0/default-step-0-0: html/libgnt-gnt.html:277: warning: no link for: "TRUE:CAPS" -> (<code class="literal">TRUE</code>).
23-Jan-2019 23:44:24 2019-01-23 18:44:24.116 default/stage-0/default-step-0-0: html/libgnt-gnt.html:562: warning: no link for: "g-free" -> (<code class="function">g_free()</code>).
23-Jan-2019 23:44:24 2019-01-23 18:44:24.116 default/stage-0/default-step-0-0: html/libgnt-gntbindable.html:189: warning: no link for: "GList" -> (<span class="type">GList</span>).
23-Jan-2019 23:44:24 2019-01-23 18:44:24.116 default/stage-0/default-step-0-0: html/libgnt-gntcheckbox.html:100: warning: no link for: "G-SIGNAL-RUN-LAST:CAPS" -> (Run Last).
23-Jan-2019 23:44:24 2019-01-23 18:44:24.116 default/stage-0/default-step-0-0: html/libgnt-gntcolors.html:136: warning: no link for: "GKeyFile" -> (<span class="type">GKeyFile</span>).
23-Jan-2019 23:44:24 2019-01-23 18:44:24.116 default/stage-0/default-step-0-0: html/libgnt-gntfilesel.html:448: warning: no link for: "g-list-free" -> (<code class="function">g_list_free()</code>).
23-Jan-2019 23:44:24 2019-01-23 18:44:24.116 default/stage-0/default-step-0-0: html/libgnt-gntstyle.html:288: warning: no link for: "g-strfreev" -> (<code class="function">g_strfreev()</code>).
23-Jan-2019 23:44:24 2019-01-23 18:44:24.116 default/stage-0/default-step-0-0: html/libgnt-gntstyle.html:396: warning: no link for: "GType" -> (<span class="type">GType</span>).
23-Jan-2019 23:44:24 2019-01-23 18:44:24.116 default/stage-0/default-step-0-0: html/libgnt-gntstyle.html:397: warning: no link for: "GHashTable" -> (<span class="type">GHashTable</span>).
23-Jan-2019 23:44:24 2019-01-23 18:44:24.116 default/stage-0/default-step-0-0: html/libgnt-gnttree.html:1675: warning: no link for: "GCompareFunc" -> (<span class="type">GCompareFunc</span>).
23-Jan-2019 23:44:24 2019-01-23 18:44:24.116 default/stage-0/default-step-0-0: html/libgnt-gntutils.html:295: warning: no link for: "GHashFunc" -> (<span class="type">GHashFunc</span>).
23-Jan-2019 23:44:24 2019-01-23 18:44:24.116 default/stage-0/default-step-0-0: html/libgnt-gntutils.html:296: warning: no link for: "GEqualFunc" -> (<span class="type">GEqualFunc</span>).
23-Jan-2019 23:44:24 2019-01-23 18:44:24.116 default/stage-0/default-step-0-0: html/libgnt-gntutils.html:297: warning: no link for: "GDestroyNotify" -> (<span class="type">GDestroyNotify</span>).
23-Jan-2019 23:44:24 2019-01-23 18:44:24.116 default/stage-0/default-step-0-0: html/libgnt-gntutils.html:359: warning: no link for: "GSignalInvocationHint" -> (<span class="type">GSignalInvocationHint</span>).
23-Jan-2019 23:44:24 2019-01-23 18:44:24.116 default/stage-0/default-step-0-0: html/libgnt-gntutils.html:360: warning: no link for: "GValue" -> (<span class="type">GValue</span>).
23-Jan-2019 23:44:24 2019-01-23 18:44:24.116 default/stage-0/default-step-0-0: html/libgnt-gntwm.html:972: warning: no link for: "GMainLoop" -> (<span class="type">GMainLoop</span>).
23-Jan-2019 23:44:24 2019-01-23 18:44:24.116 default/stage-0/default-step-0-0:
23-Jan-2019 23:44:24 2019-01-23 18:44:24.152 default/stage-0/default-step-0-0: Installing libgnt.so.1.9.0 to /usr/lib/x86_64-linux-gnu
23-Jan-2019 23:44:24 2019-01-23 18:44:24.152 default/stage-0/default-step-0-0: Installing Gnt-2.9.gir to /usr/share/gir-1.0
23-Jan-2019 23:44:24 2019-01-23 18:44:24.152 default/stage-0/default-step-0-0: Installing Gnt-2.9.typelib to /usr/lib/x86_64-linux-gnu/girepository-1.0
23-Jan-2019 23:44:24 2019-01-23 18:44:24.152 default/stage-0/default-step-0-0: Installing wms/irssi.so to /usr/lib/x86_64-linux-gnu/gnt
23-Jan-2019 23:44:24 2019-01-23 18:44:24.152 default/stage-0/default-step-0-0: Installing wms/s.so to /usr/lib/x86_64-linux-gnu/gnt
23-Jan-2019 23:44:24 2019-01-23 18:44:24.152 default/stage-0/default-step-0-0: Installing /workspace/libgnt/gntwidget.h to /usr/include/gnt
23-Jan-2019 23:44:24 2019-01-23 18:44:24.152 default/stage-0/default-step-0-0: Installing /workspace/libgnt/gntbindable.h to /usr/include/gnt
23-Jan-2019 23:44:24 2019-01-23 18:44:24.152 default/stage-0/default-step-0-0: Installing /workspace/libgnt/gntbox.h to /usr/include/gnt
23-Jan-2019 23:44:24 2019-01-23 18:44:24.152 default/stage-0/default-step-0-0: Installing /workspace/libgnt/gntbutton.h to /usr/include/gnt
23-Jan-2019 23:44:24 2019-01-23 18:44:24.152 default/stage-0/default-step-0-0: Installing /workspace/libgnt/gntcheckbox.h to /usr/include/gnt
23-Jan-2019 23:44:24 2019-01-23 18:44:24.152 default/stage-0/default-step-0-0: Installing /workspace/libgnt/gntclipboard.h to /usr/include/gnt
23-Jan-2019 23:44:24 2019-01-23 18:44:24.152 default/stage-0/default-step-0-0: Installing /workspace/libgnt/gntcolors.h to /usr/include/gnt
23-Jan-2019 23:44:24 2019-01-23 18:44:24.152 default/stage-0/default-step-0-0: Installing /workspace/libgnt/gntcombobox.h to /usr/include/gnt
23-Jan-2019 23:44:24 2019-01-23 18:44:24.152 default/stage-0/default-step-0-0: Installing /workspace/libgnt/gntentry.h to /usr/include/gnt
23-Jan-2019 23:44:24 2019-01-23 18:44:24.152 default/stage-0/default-step-0-0: Installing /workspace/libgnt/gntfilesel.h to /usr/include/gnt
23-Jan-2019 23:44:24 2019-01-23 18:44:24.152 default/stage-0/default-step-0-0: Installing /workspace/libgnt/gntkeys.h to /usr/include/gnt
23-Jan-2019 23:44:24 2019-01-23 18:44:24.152 default/stage-0/default-step-0-0: Installing /workspace/libgnt/gntlabel.h to /usr/include/gnt
23-Jan-2019 23:44:24 2019-01-23 18:44:24.152 default/stage-0/default-step-0-0: Installing /workspace/libgnt/gntline.h to /usr/include/gnt
23-Jan-2019 23:44:24 2019-01-23 18:44:24.152 default/stage-0/default-step-0-0: Installing /workspace/libgnt/gntmenu.h to /usr/include/gnt
23-Jan-2019 23:44:24 2019-01-23 18:44:24.152 default/stage-0/default-step-0-0: Installing /workspace/libgnt/gntmenuitem.h to /usr/include/gnt
23-Jan-2019 23:44:24 2019-01-23 18:44:24.152 default/stage-0/default-step-0-0: Installing /workspace/libgnt/gntmenuitemcheck.h to /usr/include/gnt
23-Jan-2019 23:44:24 2019-01-23 18:44:24.152 default/stage-0/default-step-0-0: Installing /workspace/libgnt/gntprogressbar.h to /usr/include/gnt
23-Jan-2019 23:44:24 2019-01-23 18:44:24.152 default/stage-0/default-step-0-0: Installing /workspace/libgnt/gntslider.h to /usr/include/gnt
23-Jan-2019 23:44:24 2019-01-23 18:44:24.152 default/stage-0/default-step-0-0: Installing /workspace/libgnt/gntstyle.h to /usr/include/gnt
23-Jan-2019 23:44:24 2019-01-23 18:44:24.152 default/stage-0/default-step-0-0: Installing /workspace/libgnt/gnttextview.h to /usr/include/gnt
23-Jan-2019 23:44:24 2019-01-23 18:44:24.152 default/stage-0/default-step-0-0: Installing /workspace/libgnt/gnttree.h to /usr/include/gnt
23-Jan-2019 23:44:24 2019-01-23 18:44:24.152 default/stage-0/default-step-0-0: Installing /workspace/libgnt/gntutils.h to /usr/include/gnt
23-Jan-2019 23:44:24 2019-01-23 18:44:24.152 default/stage-0/default-step-0-0: Installing /workspace/libgnt/gntwindow.h to /usr/include/gnt
23-Jan-2019 23:44:24 2019-01-23 18:44:24.152 default/stage-0/default-step-0-0: Installing /workspace/libgnt/gntwm.h to /usr/include/gnt
23-Jan-2019 23:44:24 2019-01-23 18:44:24.152 default/stage-0/default-step-0-0: Installing /workspace/libgnt/gntws.h to /usr/include/gnt
23-Jan-2019 23:44:24 2019-01-23 18:44:24.152 default/stage-0/default-step-0-0: Installing /workspace/libgnt/build/gntversion.h to /usr/include/gnt
23-Jan-2019 23:44:24 2019-01-23 18:44:24.152 default/stage-0/default-step-0-0: Installing /workspace/libgnt/build/gnt.h to /usr/include/gnt
23-Jan-2019 23:44:24 2019-01-23 18:44:24.152 default/stage-0/default-step-0-0: Installing /workspace/libgnt/build/meson-private/gnt.pc to /usr/lib/x86_64-linux-gnu/pkgconfig
23-Jan-2019 23:44:24 2019-01-23 18:44:24.152 default/stage-0/default-step-0-0: Running custom install script '/usr/bin/python3 /usr/bin/meson --internal gtkdoc --sourcedir=/workspace/libgnt --builddir=/workspace/libgnt/build --subdir=doc --headerdirs=/workspace/libgnt/.@@/workspace/libgnt/build/. --mainfile=libgnt-docs.xml --modulename=libgnt --mode=auto --scanargs=--deprecated-guards=GNT_DISABLE_DEPRECATED@@--rebuild-types@@--rebuild-sections@@--ignore-headers=test wms gntinternal.h gnt-skel.h --gobjects-types-file=/workspace/libgnt/doc/libgnt.types --mkdbargs=--ignore-files=test wms gntinternal.h gnt-skel.h --content-files= --cflags=-I/workspace/libgnt/build/. -I/workspace/libgnt/. -D_DEFAULT_SOURCE -D_XOPEN_SOURCE=600 -I/usr/include/libxml2 -I/usr/include/glib-2.0 -I/usr/lib/x86_64-linux-gnu/glib-2.0/include -pthread -I/usr/include/python3.6m -I/usr/include/x86_64-linux-gnu/python3.6m --ldflags=-L/workspace/libgnt/build/ -Wl,-rpath,/workspace/libgnt/build/ -lgnt -lncursesw -ltinfo -lpanelw -lxml2 -lglib-2.0 -lgobject-2.0 -lgmodule-2.0 -pthread -lpython3.6m --cc=cc --ld=cc'
23-Jan-2019 23:44:24 2019-01-23 18:44:24.198 default/stage-0/default-step-0-0: + ldconfig
23-Jan-2019 23:44:24 2019-01-23 18:44:24.430 default/stage-0/default-step-0-0: + meson -Dsilc=false -Ddoc=true -Dconsole-logging=true build-pipelines
23-Jan-2019 23:44:29 2019-01-23 18:44:29.925 default/stage-0/default-step-0-0: The Meson build system
23-Jan-2019 23:44:29 2019-01-23 18:44:29.925 default/stage-0/default-step-0-0: Version: 0.47.2
23-Jan-2019 23:44:29 2019-01-23 18:44:29.925 default/stage-0/default-step-0-0: Source dir: /workspace
23-Jan-2019 23:44:29 2019-01-23 18:44:29.925 default/stage-0/default-step-0-0: Build dir: /workspace/build-pipelines
23-Jan-2019 23:44:29 2019-01-23 18:44:29.925 default/stage-0/default-step-0-0: Build type: native build
23-Jan-2019 23:44:29 2019-01-23 18:44:29.925 default/stage-0/default-step-0-0: Project name: pidgin
23-Jan-2019 23:44:29 2019-01-23 18:44:29.925 default/stage-0/default-step-0-0: Project version: undefined
23-Jan-2019 23:44:29 2019-01-23 18:44:29.925 default/stage-0/default-step-0-0: Native C compiler: cc (gcc 8.2.0 "cc (Debian 8.2.0-6) 8.2.0")
23-Jan-2019 23:44:29 2019-01-23 18:44:29.925 default/stage-0/default-step-0-0: Build machine cpu family: x86_64
23-Jan-2019 23:44:29 2019-01-23 18:44:29.925 default/stage-0/default-step-0-0: Build machine cpu: x86_64
23-Jan-2019 23:44:29 2019-01-23 18:44:29.925 default/stage-0/default-step-0-0: Found mercurial repository at /workspace
23-Jan-2019 23:44:29 2019-01-23 18:44:29.925 default/stage-0/default-step-0-0: Program sed found: YES (/usr/bin/sed)
23-Jan-2019 23:44:29 2019-01-23 18:44:29.925 default/stage-0/default-step-0-0: Program mkmesonconf.py found: YES (/workspace/mkmesonconf.py)
23-Jan-2019 23:44:29 2019-01-23 18:44:29.925 default/stage-0/default-step-0-0: Has header "sys/wait.h": YES
23-Jan-2019 23:44:29 2019-01-23 18:44:29.925 default/stage-0/default-step-0-0: Has header "fcntl.h": YES
23-Jan-2019 23:44:29 2019-01-23 18:44:29.925 default/stage-0/default-step-0-0: Has header "unistd.h": YES
23-Jan-2019 23:44:29 2019-01-23 18:44:29.925 default/stage-0/default-step-0-0: Has header "stdint.h": YES
23-Jan-2019 23:44:29 2019-01-23 18:44:29.925 default/stage-0/default-step-0-0: Checking for size of "time_t": 8
23-Jan-2019 23:44:29 2019-01-23 18:44:29.925 default/stage-0/default-step-0-0: Checking for function "inet_aton" : YES
23-Jan-2019 23:44:29 2019-01-23 18:44:29.925 default/stage-0/default-step-0-0: Checking for function "gethostent" : YES
23-Jan-2019 23:44:29 2019-01-23 18:44:29.925 default/stage-0/default-step-0-0: Checking for function "socket" : YES
23-Jan-2019 23:44:29 2019-01-23 18:44:29.925 default/stage-0/default-step-0-0: Checking for function "getaddrinfo" : YES
23-Jan-2019 23:44:29 2019-01-23 18:44:29.925 default/stage-0/default-step-0-0: Checking for function "inet_ntop" : YES
23-Jan-2019 23:44:29 2019-01-23 18:44:29.925 default/stage-0/default-step-0-0: Checking for function "getifaddrs" : YES
23-Jan-2019 23:44:29 2019-01-23 18:44:29.925 default/stage-0/default-step-0-0: Header <sys/socket.h> has symbol "socklen_t": YES
23-Jan-2019 23:44:29 2019-01-23 18:44:29.925 default/stage-0/default-step-0-0: Checking whether type "struct sockaddr" has member "sa_len" : NO
23-Jan-2019 23:44:29 2019-01-23 18:44:29.925 default/stage-0/default-step-0-0: Header <netinet/in.h> has symbol "IPV6_V6ONLY": YES
23-Jan-2019 23:44:29 2019-01-23 18:44:29.925 default/stage-0/default-step-0-0: Library m found: YES
23-Jan-2019 23:44:29 2019-01-23 18:44:29.925 default/stage-0/default-step-0-0: Found pkg-config: /usr/bin/pkg-config (0.29)
23-Jan-2019 23:44:29 2019-01-23 18:44:29.925 default/stage-0/default-step-0-0: Native dependency glib-2.0 found: YES 2.56.1
23-Jan-2019 23:44:29 2019-01-23 18:44:29.925 default/stage-0/default-step-0-0: Native dependency gio-2.0 found: YES 2.56.1
23-Jan-2019 23:44:29 2019-01-23 18:44:29.925 default/stage-0/default-step-0-0: Native dependency gobject-2.0 found: YES 2.56.1
23-Jan-2019 23:44:29 2019-01-23 18:44:29.925 default/stage-0/default-step-0-0: Native dependency gthread-2.0 found: YES 2.56.1
23-Jan-2019 23:44:29 2019-01-23 18:44:29.925 default/stage-0/default-step-0-0: Native dependency gtk+-3.0 found: YES 3.22.30
23-Jan-2019 23:44:29 2019-01-23 18:44:29.925 default/stage-0/default-step-0-0: Native dependency webkitgtk-3.0 found: YES 2.4.11
23-Jan-2019 23:44:29 2019-01-23 18:44:29.925 default/stage-0/default-step-0-0: Native dependency talkatu found: YES 0.1.0-dev
23-Jan-2019 23:44:29 2019-01-23 18:44:29.925 default/stage-0/default-step-0-0: Native dependency enchant found: YES 1.6.0
23-Jan-2019 23:44:29 2019-01-23 18:44:29.925 default/stage-0/default-step-0-0: Native dependency x11 found: YES 1.6.6
23-Jan-2019 23:44:29 2019-01-23 18:44:29.925 default/stage-0/default-step-0-0: Native dependency libxml-2.0 found: YES 2.9.4
23-Jan-2019 23:44:29 2019-01-23 18:44:29.925 default/stage-0/default-step-0-0: Native dependency json-glib-1.0 found: YES 1.4.2
23-Jan-2019 23:44:29 2019-01-23 18:44:29.925 default/stage-0/default-step-0-0: Native dependency gstreamer-1.0 found: YES 1.14.2
23-Jan-2019 23:44:29 2019-01-23 18:44:29.925 default/stage-0/default-step-0-0: Native dependency gstreamer-video-1.0 found: YES 1.14.2
23-Jan-2019 23:44:29 2019-01-23 18:44:29.925 default/stage-0/default-step-0-0: Native dependency farstream-0.2 found: YES 0.2.8
23-Jan-2019 23:44:29 2019-01-23 18:44:29.925 default/stage-0/default-step-0-0: Native dependency gstreamer-app-1.0 found: YES 1.14.2
23-Jan-2019 23:44:29 2019-01-23 18:44:29.925 default/stage-0/default-step-0-0: Native dependency meanwhile found: YES 1.0.2
23-Jan-2019 23:44:29 2019-01-23 18:44:29.925 default/stage-0/default-step-0-0: Native dependency avahi-client found: YES 0.7
23-Jan-2019 23:44:29 2019-01-23 18:44:29.925 default/stage-0/default-step-0-0: Native dependency avahi-glib found: YES 0.7
23-Jan-2019 23:44:29 2019-01-23 18:44:29.925 default/stage-0/default-step-0-0: Native dependency libgadu found: YES 1.12.2
23-Jan-2019 23:44:29 2019-01-23 18:44:29.925 default/stage-0/default-step-0-0: Checking for function "gg_is_gpl_compliant" : YES
23-Jan-2019 23:44:29 2019-01-23 18:44:29.925 default/stage-0/default-step-0-0: Has header "sys/utsname.h": YES
23-Jan-2019 23:44:29 2019-01-23 18:44:29.925 default/stage-0/default-step-0-0: Checking for function "uname" : YES
23-Jan-2019 23:44:29 2019-01-23 18:44:29.925 default/stage-0/default-step-0-0: Compiler for C supports arguments -Waggregate-return: YES
23-Jan-2019 23:44:29 2019-01-23 18:44:29.925 default/stage-0/default-step-0-0: Compiler for C supports arguments -Wcast-align: YES
23-Jan-2019 23:44:29 2019-01-23 18:44:29.925 default/stage-0/default-step-0-0: Compiler for C supports arguments -Wdeclaration-after-statement: YES
23-Jan-2019 23:44:29 2019-01-23 18:44:29.925 default/stage-0/default-step-0-0: Compiler for C supports arguments -Wendif-labels: YES
23-Jan-2019 23:44:29 2019-01-23 18:44:29.925 default/stage-0/default-step-0-0: Compiler for C supports arguments -Werror-implicit-function-declaration: YES
23-Jan-2019 23:44:29 2019-01-23 18:44:29.925 default/stage-0/default-step-0-0: Compiler for C supports arguments -Wextra -Wno-unused-parameter: NO
23-Jan-2019 23:44:29 2019-01-23 18:44:29.925 default/stage-0/default-step-0-0: Compiler for C supports arguments -Wformat: YES
23-Jan-2019 23:44:29 2019-01-23 18:44:29.925 default/stage-0/default-step-0-0: Compiler for C supports arguments -Wformat-security: YES
23-Jan-2019 23:44:29 2019-01-23 18:44:29.925 default/stage-0/default-step-0-0: Compiler for C supports arguments -Werror=format-security: NO
23-Jan-2019 23:44:29 2019-01-23 18:44:29.925 default/stage-0/default-step-0-0: Compiler for C supports arguments -Winit-self: YES
23-Jan-2019 23:44:29 2019-01-23 18:44:29.925 default/stage-0/default-step-0-0: Compiler for C supports arguments -Wmissing-declarations: YES
23-Jan-2019 23:44:29 2019-01-23 18:44:29.925 default/stage-0/default-step-0-0: Compiler for C supports arguments -Wmissing-noreturn: YES
23-Jan-2019 23:44:29 2019-01-23 18:44:29.925 default/stage-0/default-step-0-0: Compiler for C supports arguments -Wmissing-prototypes: YES
23-Jan-2019 23:44:29 2019-01-23 18:44:29.925 default/stage-0/default-step-0-0: Compiler for C supports arguments -Wpointer-arith: YES
23-Jan-2019 23:44:29 2019-01-23 18:44:29.925 default/stage-0/default-step-0-0: Compiler for C supports arguments -Wfloat-equal: YES
23-Jan-2019 23:44:29 2019-01-23 18:44:29.925 default/stage-0/default-step-0-0: Compiler for C supports arguments -Wundef: YES
23-Jan-2019 23:44:29 2019-01-23 18:44:29.925 default/stage-0/default-step-0-0: Program pidgin found: NO
23-Jan-2019 23:44:29 2019-01-23 18:44:29.925 default/stage-0/default-step-0-0: Native dependency libsecret-1 found: YES 0.18.6
23-Jan-2019 23:44:29 2019-01-23 18:44:29.925 default/stage-0/default-step-0-0: Native dependency gplugin found: YES 0.28.0dev
23-Jan-2019 23:44:29 2019-01-23 18:44:29.925 default/stage-0/default-step-0-0: Native dependency gobject-introspection-1.0 found: YES 1.56.1
23-Jan-2019 23:44:29 2019-01-23 18:44:29.925 default/stage-0/default-step-0-0: Native dependency nettle found: YES 3.4
23-Jan-2019 23:44:29 2019-01-23 18:44:29.925 default/stage-0/default-step-0-0: Checking for function "snprintf" : YES
23-Jan-2019 23:44:29 2019-01-23 18:44:29.925 default/stage-0/default-step-0-0: Checking for function "connect" : YES
23-Jan-2019 23:44:29 2019-01-23 18:44:29.925 default/stage-0/default-step-0-0: Checking for function "gethostid" : YES
23-Jan-2019 23:44:29 2019-01-23 18:44:29.925 default/stage-0/default-step-0-0: Checking for function "timegm" : YES
23-Jan-2019 23:44:29 2019-01-23 18:44:29.925 default/stage-0/default-step-0-0: Has header "paths.h": YES
23-Jan-2019 23:44:29 2019-01-23 18:44:29.925 default/stage-0/default-step-0-0: Has header "sgtty.h": YES
23-Jan-2019 23:44:29 2019-01-23 18:44:29.925 default/stage-0/default-step-0-0: Has header "sys/cdefs.h": YES
23-Jan-2019 23:44:29 2019-01-23 18:44:29.925 default/stage-0/default-step-0-0: Has header "sys/file.h": YES
23-Jan-2019 23:44:29 2019-01-23 18:44:29.925 default/stage-0/default-step-0-0: Has header "sys/filio.h": NO
23-Jan-2019 23:44:29 2019-01-23 18:44:29.925 default/stage-0/default-step-0-0: Has header "sys/ioctl.h": YES
23-Jan-2019 23:44:29 2019-01-23 18:44:29.925 default/stage-0/default-step-0-0: Has header "sys/msgbuf.h": NO
23-Jan-2019 23:44:29 2019-01-23 18:44:29.925 default/stage-0/default-step-0-0: Has header "sys/select.h": YES
23-Jan-2019 23:44:29 2019-01-23 18:44:29.925 default/stage-0/default-step-0-0: Has header "sys/uio.h": YES
23-Jan-2019 23:44:29 2019-01-23 18:44:29.925 default/stage-0/default-step-0-0: Has header "sys/utsname.h": YES
23-Jan-2019 23:44:29 2019-01-23 18:44:29.925 default/stage-0/default-step-0-0: Has header "sys/wait.h": YES
23-Jan-2019 23:44:29 2019-01-23 18:44:29.925 default/stage-0/default-step-0-0: Has header "termios.h": YES
23-Jan-2019 23:44:29 2019-01-23 18:44:29.925 default/stage-0/default-step-0-0: Has header "sys/param.h": YES
23-Jan-2019 23:44:29 2019-01-23 18:44:29.925 default/stage-0/default-step-0-0: Has header "sys/sysctl.h": YES
23-Jan-2019 23:44:29 2019-01-23 18:44:29.925 default/stage-0/default-step-0-0: Has header "sys/socket.h": YES
23-Jan-2019 23:44:29 2019-01-23 18:44:29.925 default/stage-0/default-step-0-0: Configuring purple.h using configuration
23-Jan-2019 23:44:29 2019-01-23 18:44:29.925 default/stage-0/default-step-0-0: Configuring version.h using configuration
23-Jan-2019 23:44:29 2019-01-23 18:44:29.925 default/stage-0/default-step-0-0: WARNING: Project targetting '>=0.37.0' but tried to use feature introduced in '0.41.0': variables arg in pkgconfig.generate
23-Jan-2019 23:44:29 2019-01-23 18:44:29.925 default/stage-0/default-step-0-0: WARNING: Project targetting '>=0.37.0' but tried to use feature introduced in '0.41.0': custom pkgconfig variables
23-Jan-2019 23:44:29 2019-01-23 18:44:29.925 default/stage-0/default-step-0-0: Native dependency gobject-introspection-1.0 found: YES 1.56.1
23-Jan-2019 23:44:29 2019-01-23 18:44:29.925 default/stage-0/default-step-0-0: Native dependency libidn found: YES 1.33
23-Jan-2019 23:44:29 2019-01-23 18:44:29.925 default/stage-0/default-step-0-0: Native dependency gnt found: YES 2.9.0-devel
23-Jan-2019 23:44:29 2019-01-23 18:44:29.925 default/stage-0/default-step-0-0: Native dependency ncursesw found: YES 6.1.20180714
23-Jan-2019 23:44:29 2019-01-23 18:44:29.925 default/stage-0/default-step-0-0: Header <ncurses.h> has symbol "get_wch": YES
23-Jan-2019 23:44:29 2019-01-23 18:44:29.925 default/stage-0/default-step-0-0: Header <ncursesw/ncurses.h> has symbol "get_wch": YES
23-Jan-2019 23:44:29 2019-01-23 18:44:29.925 default/stage-0/default-step-0-0: Native dependency glib-2.0 found: YES 2.56.1
23-Jan-2019 23:44:29 2019-01-23 18:44:29.925 default/stage-0/default-step-0-0: Configuring im.pidgin.Pidgin.desktop.in using configuration
23-Jan-2019 23:44:29 2019-01-23 18:44:29.925 default/stage-0/default-step-0-0: WARNING: Project targetting '>=0.37.0' but tried to use feature introduced in '0.42.0': exclude_files arg in install_subdir
23-Jan-2019 23:44:29 2019-01-23 18:44:29.925 default/stage-0/default-step-0-0: WARNING: Project targetting '>=0.37.0' but tried to use feature introduced in '0.42.0': exclude_directories arg in install_subdir
23-Jan-2019 23:44:29 2019-01-23 18:44:29.925 default/stage-0/default-step-0-0: Configuring version.xml using configuration
23-Jan-2019 23:44:29 2019-01-23 18:44:29.925 default/stage-0/default-step-0-0: Configuring version.xml using configuration
23-Jan-2019 23:44:29 2019-01-23 18:44:29.925 default/stage-0/default-step-0-0: Configuring version.xml using configuration
23-Jan-2019 23:44:29 2019-01-23 18:44:29.925 default/stage-0/default-step-0-0: Configuring pidgin.1 using configuration
23-Jan-2019 23:44:29 2019-01-23 18:44:29.925 default/stage-0/default-step-0-0: Configuring finch.1 using configuration
23-Jan-2019 23:44:29 2019-01-23 18:44:29.925 default/stage-0/default-step-0-0: Configuring config.h using configuration
23-Jan-2019 23:44:29 2019-01-23 18:44:29.925 default/stage-0/default-step-0-0: Message:
23-Jan-2019 23:44:29 2019-01-23 18:44:29.925 default/stage-0/default-step-0-0: Message: pidgin 3.0.0devel
23-Jan-2019 23:44:29 2019-01-23 18:44:29.925 default/stage-0/default-step-0-0: Message:
23-Jan-2019 23:44:29 2019-01-23 18:44:29.925 default/stage-0/default-step-0-0: Message: Build GTK+ UI................. : true
23-Jan-2019 23:44:29 2019-01-23 18:44:29.925 default/stage-0/default-step-0-0: Message: Build console UI.............. : true
23-Jan-2019 23:44:29 2019-01-23 18:44:29.925 default/stage-0/default-step-0-0: Message: Build for X11................. : true
23-Jan-2019 23:44:29 2019-01-23 18:44:29.925 default/stage-0/default-step-0-0: Message:
23-Jan-2019 23:44:29 2019-01-23 18:44:29.926 default/stage-0/default-step-0-0: Message: Enable Gestures............... : true
23-Jan-2019 23:44:29 2019-01-23 18:44:29.926 default/stage-0/default-step-0-0: Message: Protocols to build dynamically : ['bonjour', 'facebook', 'gg', 'irc', 'jabber', 'novell', 'oscar', 'sametime', 'simple', 'zephyr']
23-Jan-2019 23:44:29 2019-01-23 18:44:29.926 default/stage-0/default-step-0-0: Message:
23-Jan-2019 23:44:29 2019-01-23 18:44:29.926 default/stage-0/default-step-0-0: Message: Build with GStreamer support.. : true
23-Jan-2019 23:44:29 2019-01-23 18:44:29.926 default/stage-0/default-step-0-0: Message: Build with voice and video.... : true
23-Jan-2019 23:44:29 2019-01-23 18:44:29.926 default/stage-0/default-step-0-0: Message: Build with GNU Libidn......... : true
23-Jan-2019 23:44:29 2019-01-23 18:44:29.926 default/stage-0/default-step-0-0: Message: Build with Nettle support..... : true
23-Jan-2019 23:44:29 2019-01-23 18:44:29.926 default/stage-0/default-step-0-0: Message: Build with Cyrus SASL support. : false
23-Jan-2019 23:44:29 2019-01-23 18:44:29.926 default/stage-0/default-step-0-0: Message: Use kerberos 4 with zephyr.... : false
23-Jan-2019 23:44:29 2019-01-23 18:44:29.926 default/stage-0/default-step-0-0: Message: Use external libzephyr........ : false
23-Jan-2019 23:44:29 2019-01-23 18:44:29.926 default/stage-0/default-step-0-0: Message: Install pixmaps............... : true
23-Jan-2019 23:44:29 2019-01-23 18:44:29.926 default/stage-0/default-step-0-0: Message: Install translations.......... : true
23-Jan-2019 23:44:29 2019-01-23 18:44:29.926 default/stage-0/default-step-0-0: Message: Has you....................... : yes
23-Jan-2019 23:44:29 2019-01-23 18:44:29.926 default/stage-0/default-step-0-0: Message:
23-Jan-2019 23:44:29 2019-01-23 18:44:29.926 default/stage-0/default-step-0-0: Message: Build with Enchant support.... : true
23-Jan-2019 23:44:29 2019-01-23 18:44:29.926 default/stage-0/default-step-0-0: Message: Build Unity integration plugin.: false
23-Jan-2019 23:44:29 2019-01-23 18:44:29.926 default/stage-0/default-step-0-0: Message:
23-Jan-2019 23:44:29 2019-01-23 18:44:29.926 default/stage-0/default-step-0-0: Message: Build with KWallet............ : false
23-Jan-2019 23:44:29 2019-01-23 18:44:29.926 default/stage-0/default-step-0-0: Message: Build with Secret Service..... : true
23-Jan-2019 23:44:29 2019-01-23 18:44:29.926 default/stage-0/default-step-0-0: Message:
23-Jan-2019 23:44:29 2019-01-23 18:44:29.926 default/stage-0/default-step-0-0: Message: Build plugins................. : true
23-Jan-2019 23:44:29 2019-01-23 18:44:29.926 default/stage-0/default-step-0-0: Message: Enable Introspection...........: true
23-Jan-2019 23:44:29 2019-01-23 18:44:29.926 default/stage-0/default-step-0-0: Message:
23-Jan-2019 23:44:29 2019-01-23 18:44:29.926 default/stage-0/default-step-0-0: Message: Print debugging messages...... : true
23-Jan-2019 23:44:29 2019-01-23 18:44:29.926 default/stage-0/default-step-0-0: Message: Generate documentation........ : true
23-Jan-2019 23:44:29 2019-01-23 18:44:29.926 default/stage-0/default-step-0-0: Message:
23-Jan-2019 23:44:29 2019-01-23 18:44:29.926 default/stage-0/default-step-0-0: Message: Pidgin will be installed in /usr/local/bin.
23-Jan-2019 23:44:29 2019-01-23 18:44:29.926 default/stage-0/default-step-0-0: Message:
23-Jan-2019 23:44:29 2019-01-23 18:44:29.926 default/stage-0/default-step-0-0: Message: configure complete, now type 'ninja'
23-Jan-2019 23:44:29 2019-01-23 18:44:29.926 default/stage-0/default-step-0-0: Message:
23-Jan-2019 23:44:29 2019-01-23 18:44:29.926 default/stage-0/default-step-0-0: Build targets in project: 96
23-Jan-2019 23:44:29 2019-01-23 18:44:29.926 default/stage-0/default-step-0-0: WARNING: Project specifies a minimum meson_version '>=0.37.0' but uses features which were added in newer versions:
23-Jan-2019 23:44:29 2019-01-23 18:44:29.926 default/stage-0/default-step-0-0: * 0.41.0: {'custom pkgconfig variables', 'variables arg in pkgconfig.generate'}
23-Jan-2019 23:44:29 2019-01-23 18:44:29.926 default/stage-0/default-step-0-0: * 0.42.0: {'exclude_directories arg in install_subdir', 'exclude_files arg in install_subdir'}
23-Jan-2019 23:44:29 2019-01-23 18:44:29.926 default/stage-0/default-step-0-0: Found ninja-1.8.2 at /usr/bin/ninja
23-Jan-2019 23:44:29 2019-01-23 18:44:29.982 default/stage-0/default-step-0-0: + ninja -C build-pipelines
23-Jan-2019 23:44:29 2019-01-23 18:44:29.986 default/stage-0/default-step-0-0: ninja: Entering directory `build-pipelines'
23-Jan-2019 23:44:30 2019-01-23 18:44:30.032 default/stage-0/default-step-0-0: [1/501] Generating pidginresources_h with a custom command.
23-Jan-2019 23:44:30 2019-01-23 18:44:30.046 default/stage-0/default-step-0-0: [2/501] Generating pidginresources_c with a custom command.
23-Jan-2019 23:44:30 2019-01-23 18:44:30.319 default/stage-0/default-step-0-0: [3/501] Generating small-theme with a meson_exe.py custom command.
23-Jan-2019 23:44:30 2019-01-23 18:44:30.339 default/stage-0/default-step-0-0: [4/501] Generating default-theme with a meson_exe.py custom command.
23-Jan-2019 23:44:30 2019-01-23 18:44:30.500 default/stage-0/default-step-0-0: [5/501] Generating package_revision.h with a custom command.
23-Jan-2019 23:44:30 2019-01-23 18:44:30.757 default/stage-0/default-step-0-0: [6/501] Generating enums.h with a meson_exe.py custom command.
23-Jan-2019 23:44:31 2019-01-23 18:44:31.017 default/stage-0/default-step-0-0: [7/501] Compiling C object 'libpurple/libpurple@@purple@sha/attention.c.o'.
23-Jan-2019 23:44:31 2019-01-23 18:44:31.017 default/stage-0/default-step-0-0: FAILED: libpurple/libpurple@@purple@sha/attention.c.o
23-Jan-2019 23:44:31 2019-01-23 18:44:31.017 default/stage-0/default-step-0-0: cc -Ilibpurple/libpurple@@purple@sha -Ilibpurple -I../libpurple -I. -I../ -I/usr/include/glib-2.0 -I/usr/lib/x86_64-linux-gnu/glib-2.0/include -I/usr/include/gplugin-1.0 -I/usr/include/libxml2 -I/usr/include/farstream-0.2 -I/usr/include/gstreamer-1.0 -I/usr/include/orc-0.4 -I/usr/include/json-glib-1.0 -fdiagnostics-color=always -pipe -D_FILE_OFFSET_BITS=64 -Wall -Winvalid-pch -O0 -g -DHAVE_CONFIG_H=1 -DPURPLE_DISABLE_DEPRECATED -DPIDGIN_DISABLE_DEPRECATED -DFINCH_DISABLE_DEPRECATED -DGNT_DISABLE_DEPRECATED -Waggregate-return -Wcast-align -Wdeclaration-after-statement -Wendif-labels -Werror-implicit-function-declaration -Wformat -Wformat-security -Winit-self -Wmissing-declarations -Wmissing-noreturn -Wmissing-prototypes -Wpointer-arith -Wfloat-equal -Wundef -fPIC -pthread  -MD -MQ 'libpurple/libpurple@@purple@sha/attention.c.o' -MF 'libpurple/libpurple@@purple@sha/attention.c.o.d' -o 'libpurple/libpurple@@purple@sha/attention.c.o' -c ../libpurple/attention.c
23-Jan-2019 23:44:31 2019-01-23 18:44:31.017 default/stage-0/default-step-0-0: In file included from ../libpurple/protocol.h:53,
23-Jan-2019 23:44:31 2019-01-23 18:44:31.017 default/stage-0/default-step-0-0:                  from ../libpurple/connection.h:207,
23-Jan-2019 23:44:31 2019-01-23 18:44:31.017 default/stage-0/default-step-0-0:                  from ../libpurple/account.h:53,
23-Jan-2019 23:44:31 2019-01-23 18:44:31.017 default/stage-0/default-step-0-0:                  from ../libpurple/attention.h:58,
23-Jan-2019 23:44:31 2019-01-23 18:44:31.017 default/stage-0/default-step-0-0:                  from ../libpurple/attention.c:22:
23-Jan-2019 23:44:31 2019-01-23 18:44:31.017 default/stage-0/default-step-0-0: ../libpurple/plugins.h:54:9: error: unknown type name ?GPluginPluginInterface?
23-Jan-2019 23:44:31 2019-01-23 18:44:31.017 default/stage-0/default-step-0-0: typedef GPluginPluginInterface PurplePluginInterface;
23-Jan-2019 23:44:31 2019-01-23 18:44:31.017 default/stage-0/default-step-0-0:          ^~~~~~~~~~~~~~~~~~~~~~
23-Jan-2019 23:44:31 2019-01-23 18:44:31.052 default/stage-0/default-step-0-0: [8/501] Compiling C object 'libpurple/libpurple@@purple@sha/accountopt.c.o'.
23-Jan-2019 23:44:31 2019-01-23 18:44:31.052 default/stage-0/default-step-0-0: FAILED: libpurple/libpurple@@purple@sha/accountopt.c.o
23-Jan-2019 23:44:31 2019-01-23 18:44:31.052 default/stage-0/default-step-0-0: cc -Ilibpurple/libpurple@@purple@sha -Ilibpurple -I../libpurple -I. -I../ -I/usr/include/glib-2.0 -I/usr/lib/x86_64-linux-gnu/glib-2.0/include -I/usr/include/gplugin-1.0 -I/usr/include/libxml2 -I/usr/include/farstream-0.2 -I/usr/include/gstreamer-1.0 -I/usr/include/orc-0.4 -I/usr/include/json-glib-1.0 -fdiagnostics-color=always -pipe -D_FILE_OFFSET_BITS=64 -Wall -Winvalid-pch -O0 -g -DHAVE_CONFIG_H=1 -DPURPLE_DISABLE_DEPRECATED -DPIDGIN_DISABLE_DEPRECATED -DFINCH_DISABLE_DEPRECATED -DGNT_DISABLE_DEPRECATED -Waggregate-return -Wcast-align -Wdeclaration-after-statement -Wendif-labels -Werror-implicit-function-declaration -Wformat -Wformat-security -Winit-self -Wmissing-declarations -Wmissing-noreturn -Wmissing-prototypes -Wpointer-arith -Wfloat-equal -Wundef -fPIC -pthread  -MD -MQ 'libpurple/libpurple@@purple@sha/accountopt.c.o' -MF 'libpurple/libpurple@@purple@sha/accountopt.c.o.d' -o 'libpurple/libpurple@@purple@sha/accountopt.c.o' -c ../libpurple/accountopt.c
23-Jan-2019 23:44:31 2019-01-23 18:44:31.052 default/stage-0/default-step-0-0: In file included from ../libpurple/protocol.h:53,
23-Jan-2019 23:44:31 2019-01-23 18:44:31.052 default/stage-0/default-step-0-0:                  from ../libpurple/connection.h:207,
23-Jan-2019 23:44:31 2019-01-23 18:44:31.052 default/stage-0/default-step-0-0:                  from ../libpurple/account.h:53,
23-Jan-2019 23:44:31 2019-01-23 18:44:31.052 default/stage-0/default-step-0-0:                  from ../libpurple/accounts.h:32,
23-Jan-2019 23:44:31 2019-01-23 18:44:31.052 default/stage-0/default-step-0-0:                  from ../libpurple/internal.h:158,
23-Jan-2019 23:44:31 2019-01-23 18:44:31.052 default/stage-0/default-step-0-0:                  from ../libpurple/accountopt.c:21:
23-Jan-2019 23:44:31 2019-01-23 18:44:31.052 default/stage-0/default-step-0-0: ../libpurple/plugins.h:54:9: error: unknown type name ?GPluginPluginInterface?
23-Jan-2019 23:44:31 2019-01-23 18:44:31.052 default/stage-0/default-step-0-0: typedef GPluginPluginInterface PurplePluginInterface;
23-Jan-2019 23:44:31 2019-01-23 18:44:31.052 default/stage-0/default-step-0-0:          ^~~~~~~~~~~~~~~~~~~~~~
23-Jan-2019 23:44:31 2019-01-23 18:44:31.065 default/stage-0/default-step-0-0: [9/501] Compiling C object 'libpurple/libpurple@@purple@sha/blistnode.c.o'.
23-Jan-2019 23:44:31 2019-01-23 18:44:31.065 default/stage-0/default-step-0-0: FAILED: libpurple/libpurple@@purple@sha/blistnode.c.o
23-Jan-2019 23:44:31 2019-01-23 18:44:31.065 default/stage-0/default-step-0-0: cc -Ilibpurple/libpurple@@purple@sha -Ilibpurple -I../libpurple -I. -I../ -I/usr/include/glib-2.0 -I/usr/lib/x86_64-linux-gnu/glib-2.0/include -I/usr/include/gplugin-1.0 -I/usr/include/libxml2 -I/usr/include/farstream-0.2 -I/usr/include/gstreamer-1.0 -I/usr/include/orc-0.4 -I/usr/include/json-glib-1.0 -fdiagnostics-color=always -pipe -D_FILE_OFFSET_BITS=64 -Wall -Winvalid-pch -O0 -g -DHAVE_CONFIG_H=1 -DPURPLE_DISABLE_DEPRECATED -DPIDGIN_DISABLE_DEPRECATED -DFINCH_DISABLE_DEPRECATED -DGNT_DISABLE_DEPRECATED -Waggregate-return -Wcast-align -Wdeclaration-after-statement -Wendif-labels -Werror-implicit-function-declaration -Wformat -Wformat-security -Winit-self -Wmissing-declarations -Wmissing-noreturn -Wmissing-prototypes -Wpointer-arith -Wfloat-equal -Wundef -fPIC -pthread  -MD -MQ 'libpurple/libpurple@@purple@sha/blistnode.c.o' -MF 'libpurple/libpurple@@purple@sha/blistnode.c.o.d' -o 'libpurple/libpurple@@purple@sha/blistnode.c.o' -c ../libpurple/blistnode.c
23-Jan-2019 23:44:31 2019-01-23 18:44:31.065 default/stage-0/default-step-0-0: In file included from ../libpurple/protocol.h:53,
23-Jan-2019 23:44:31 2019-01-23 18:44:31.065 default/stage-0/default-step-0-0:                  from ../libpurple/connection.h:207,
23-Jan-2019 23:44:31 2019-01-23 18:44:31.065 default/stage-0/default-step-0-0:                  from ../libpurple/account.h:53,
23-Jan-2019 23:44:31 2019-01-23 18:44:31.065 default/stage-0/default-step-0-0:                  from ../libpurple/accounts.h:32,
23-Jan-2019 23:44:31 2019-01-23 18:44:31.065 default/stage-0/default-step-0-0:                  from ../libpurple/internal.h:158,
23-Jan-2019 23:44:31 2019-01-23 18:44:31.065 default/stage-0/default-step-0-0:                  from ../libpurple/blistnode.c:23:
23-Jan-2019 23:44:31 2019-01-23 18:44:31.065 default/stage-0/default-step-0-0: ../libpurple/plugins.h:54:9: error: unknown type name ?GPluginPluginInterface?
23-Jan-2019 23:44:31 2019-01-23 18:44:31.065 default/stage-0/default-step-0-0: typedef GPluginPluginInterface PurplePluginInterface;
23-Jan-2019 23:44:31 2019-01-23 18:44:31.065 default/stage-0/default-step-0-0:          ^~~~~~~~~~~~~~~~~~~~~~
23-Jan-2019 23:44:31 2019-01-23 18:44:31.072 default/stage-0/default-step-0-0: [10/501] Compiling C object 'libpurple/libpurple@@purple@sha/accounts.c.o'.
23-Jan-2019 23:44:31 2019-01-23 18:44:31.072 default/stage-0/default-step-0-0: FAILED: libpurple/libpurple@@purple@sha/accounts.c.o
23-Jan-2019 23:44:31 2019-01-23 18:44:31.072 default/stage-0/default-step-0-0: cc -Ilibpurple/libpurple@@purple@sha -Ilibpurple -I../libpurple -I. -I../ -I/usr/include/glib-2.0 -I/usr/lib/x86_64-linux-gnu/glib-2.0/include -I/usr/include/gplugin-1.0 -I/usr/include/libxml2 -I/usr/include/farstream-0.2 -I/usr/include/gstreamer-1.0 -I/usr/include/orc-0.4 -I/usr/include/json-glib-1.0 -fdiagnostics-color=always -pipe -D_FILE_OFFSET_BITS=64 -Wall -Winvalid-pch -O0 -g -DHAVE_CONFIG_H=1 -DPURPLE_DISABLE_DEPRECATED -DPIDGIN_DISABLE_DEPRECATED -DFINCH_DISABLE_DEPRECATED -DGNT_DISABLE_DEPRECATED -Waggregate-return -Wcast-align -Wdeclaration-after-statement -Wendif-labels -Werror-implicit-function-declaration -Wformat -Wformat-security -Winit-self -Wmissing-declarations -Wmissing-noreturn -Wmissing-prototypes -Wpointer-arith -Wfloat-equal -Wundef -fPIC -pthread  -MD -MQ 'libpurple/libpurple@@purple@sha/accounts.c.o' -MF 'libpurple/libpurple@@purple@sha/accounts.c.o.d' -o 'libpurple/libpurple@@purple@sha/accounts.c.o' -c ../libpurple/accounts.c
23-Jan-2019 23:44:31 2019-01-23 18:44:31.072 default/stage-0/default-step-0-0: In file included from ../libpurple/protocol.h:53,
23-Jan-2019 23:44:31 2019-01-23 18:44:31.072 default/stage-0/default-step-0-0:                  from ../libpurple/connection.h:207,
23-Jan-2019 23:44:31 2019-01-23 18:44:31.072 default/stage-0/default-step-0-0:                  from ../libpurple/account.h:53,
23-Jan-2019 23:44:31 2019-01-23 18:44:31.072 default/stage-0/default-step-0-0:                  from ../libpurple/accounts.h:32,
23-Jan-2019 23:44:31 2019-01-23 18:44:31.072 default/stage-0/default-step-0-0:                  from ../libpurple/internal.h:158,
23-Jan-2019 23:44:31 2019-01-23 18:44:31.072 default/stage-0/default-step-0-0:                  from ../libpurple/accounts.c:21:
23-Jan-2019 23:44:31 2019-01-23 18:44:31.072 default/stage-0/default-step-0-0: ../libpurple/plugins.h:54:9: error: unknown type name ?GPluginPluginInterface?
23-Jan-2019 23:44:31 2019-01-23 18:44:31.072 default/stage-0/default-step-0-0: typedef GPluginPluginInterface PurplePluginInterface;
23-Jan-2019 23:44:31 2019-01-23 18:44:31.072 default/stage-0/default-step-0-0:          ^~~~~~~~~~~~~~~~~~~~~~
23-Jan-2019 23:44:31 2019-01-23 18:44:31.074 default/stage-0/default-step-0-0: [11/501] Compiling C object 'libpurple/libpurple@@purple@sha/buddyicon.c.o'.
23-Jan-2019 23:44:31 2019-01-23 18:44:31.074 default/stage-0/default-step-0-0: FAILED: libpurple/libpurple@@purple@sha/buddyicon.c.o
23-Jan-2019 23:44:31 2019-01-23 18:44:31.074 default/stage-0/default-step-0-0: cc -Ilibpurple/libpurple@@purple@sha -Ilibpurple -I../libpurple -I. -I../ -I/usr/include/glib-2.0 -I/usr/lib/x86_64-linux-gnu/glib-2.0/include -I/usr/include/gplugin-1.0 -I/usr/include/libxml2 -I/usr/include/farstream-0.2 -I/usr/include/gstreamer-1.0 -I/usr/include/orc-0.4 -I/usr/include/json-glib-1.0 -fdiagnostics-color=always -pipe -D_FILE_OFFSET_BITS=64 -Wall -Winvalid-pch -O0 -g -DHAVE_CONFIG_H=1 -DPURPLE_DISABLE_DEPRECATED -DPIDGIN_DISABLE_DEPRECATED -DFINCH_DISABLE_DEPRECATED -DGNT_DISABLE_DEPRECATED -Waggregate-return -Wcast-align -Wdeclaration-after-statement -Wendif-labels -Werror-implicit-function-declaration -Wformat -Wformat-security -Winit-self -Wmissing-declarations -Wmissing-noreturn -Wmissing-prototypes -Wpointer-arith -Wfloat-equal -Wundef -fPIC -pthread  -MD -MQ 'libpurple/libpurple@@purple@sha/buddyicon.c.o' -MF 'libpurple/libpurple@@purple@sha/buddyicon.c.o.d' -o 'libpurple/libpurple@@purple@sha/buddyicon.c.o' -c ../libpurple/buddyicon.c
23-Jan-2019 23:44:31 2019-01-23 18:44:31.074 default/stage-0/default-step-0-0: In file included from ../libpurple/protocol.h:53,
23-Jan-2019 23:44:31 2019-01-23 18:44:31.074 default/stage-0/default-step-0-0:                  from ../libpurple/connection.h:207,
23-Jan-2019 23:44:31 2019-01-23 18:44:31.074 default/stage-0/default-step-0-0:                  from ../libpurple/account.h:53,
23-Jan-2019 23:44:31 2019-01-23 18:44:31.074 default/stage-0/default-step-0-0:                  from ../libpurple/accounts.h:32,
23-Jan-2019 23:44:31 2019-01-23 18:44:31.074 default/stage-0/default-step-0-0:                  from ../libpurple/internal.h:158,
23-Jan-2019 23:44:31 2019-01-23 18:44:31.074 default/stage-0/default-step-0-0:                  from ../libpurple/buddyicon.c:23:
23-Jan-2019 23:44:31 2019-01-23 18:44:31.074 default/stage-0/default-step-0-0: ../libpurple/plugins.h:54:9: error: unknown type name ?GPluginPluginInterface?
23-Jan-2019 23:44:31 2019-01-23 18:44:31.074 default/stage-0/default-step-0-0: typedef GPluginPluginInterface PurplePluginInterface;
23-Jan-2019 23:44:31 2019-01-23 18:44:31.074 default/stage-0/default-step-0-0:          ^~~~~~~~~~~~~~~~~~~~~~
23-Jan-2019 23:44:31 2019-01-23 18:44:31.074 default/stage-0/default-step-0-0: [12/501] Compiling C object 'libpurple/libpurple@@purple@sha/cmds.c.o'.
23-Jan-2019 23:44:31 2019-01-23 18:44:31.074 default/stage-0/default-step-0-0: FAILED: libpurple/libpurple@@purple@sha/cmds.c.o
23-Jan-2019 23:44:31 2019-01-23 18:44:31.074 default/stage-0/default-step-0-0: cc -Ilibpurple/libpurple@@purple@sha -Ilibpurple -I../libpurple -I. -I../ -I/usr/include/glib-2.0 -I/usr/lib/x86_64-linux-gnu/glib-2.0/include -I/usr/include/gplugin-1.0 -I/usr/include/libxml2 -I/usr/include/farstream-0.2 -I/usr/include/gstreamer-1.0 -I/usr/include/orc-0.4 -I/usr/include/json-glib-1.0 -fdiagnostics-color=always -pipe -D_FILE_OFFSET_BITS=64 -Wall -Winvalid-pch -O0 -g -DHAVE_CONFIG_H=1 -DPURPLE_DISABLE_DEPRECATED -DPIDGIN_DISABLE_DEPRECATED -DFINCH_DISABLE_DEPRECATED -DGNT_DISABLE_DEPRECATED -Waggregate-return -Wcast-align -Wdeclaration-after-statement -Wendif-labels -Werror-implicit-function-declaration -Wformat -Wformat-security -Winit-self -Wmissing-declarations -Wmissing-noreturn -Wmissing-prototypes -Wpointer-arith -Wfloat-equal -Wundef -fPIC -pthread  -MD -MQ 'libpurple/libpurple@@purple@sha/cmds.c.o' -MF 'libpurple/libpurple@@purple@sha/cmds.c.o.d' -o 'libpurple/libpurple@@purple@sha/cmds.c.o' -c ../libpurple/cmds.c
23-Jan-2019 23:44:31 2019-01-23 18:44:31.074 default/stage-0/default-step-0-0: In file included from ../libpurple/protocol.h:53,
23-Jan-2019 23:44:31 2019-01-23 18:44:31.074 default/stage-0/default-step-0-0:                  from ../libpurple/connection.h:207,
23-Jan-2019 23:44:31 2019-01-23 18:44:31.074 default/stage-0/default-step-0-0:                  from ../libpurple/account.h:53,
23-Jan-2019 23:44:31 2019-01-23 18:44:31.074 default/stage-0/default-step-0-0:                  from ../libpurple/accounts.h:32,
23-Jan-2019 23:44:31 2019-01-23 18:44:31.074 default/stage-0/default-step-0-0:                  from ../libpurple/internal.h:158,
23-Jan-2019 23:44:31 2019-01-23 18:44:31.074 default/stage-0/default-step-0-0:                  from ../libpurple/cmds.c:19:
23-Jan-2019 23:44:31 2019-01-23 18:44:31.074 default/stage-0/default-step-0-0: ../libpurple/plugins.h:54:9: error: unknown type name ?GPluginPluginInterface?
23-Jan-2019 23:44:31 2019-01-23 18:44:31.074 default/stage-0/default-step-0-0: typedef GPluginPluginInterface PurplePluginInterface;
23-Jan-2019 23:44:31 2019-01-23 18:44:31.074 default/stage-0/default-step-0-0:          ^~~~~~~~~~~~~~~~~~~~~~
23-Jan-2019 23:44:31 2019-01-23 18:44:31.075 default/stage-0/default-step-0-0: [13/501] Compiling C object 'libpurple/libpurple@@purple@sha/connection.c.o'.
23-Jan-2019 23:44:31 2019-01-23 18:44:31.075 default/stage-0/default-step-0-0: FAILED: libpurple/libpurple@@purple@sha/connection.c.o
23-Jan-2019 23:44:31 2019-01-23 18:44:31.075 default/stage-0/default-step-0-0: cc -Ilibpurple/libpurple@@purple@sha -Ilibpurple -I../libpurple -I. -I../ -I/usr/include/glib-2.0 -I/usr/lib/x86_64-linux-gnu/glib-2.0/include -I/usr/include/gplugin-1.0 -I/usr/include/libxml2 -I/usr/include/farstream-0.2 -I/usr/include/gstreamer-1.0 -I/usr/include/orc-0.4 -I/usr/include/json-glib-1.0 -fdiagnostics-color=always -pipe -D_FILE_OFFSET_BITS=64 -Wall -Winvalid-pch -O0 -g -DHAVE_CONFIG_H=1 -DPURPLE_DISABLE_DEPRECATED -DPIDGIN_DISABLE_DEPRECATED -DFINCH_DISABLE_DEPRECATED -DGNT_DISABLE_DEPRECATED -Waggregate-return -Wcast-align -Wdeclaration-after-statement -Wendif-labels -Werror-implicit-function-declaration -Wformat -Wformat-security -Winit-self -Wmissing-declarations -Wmissing-noreturn -Wmissing-prototypes -Wpointer-arith -Wfloat-equal -Wundef -fPIC -pthread  -MD -MQ 'libpurple/libpurple@@purple@sha/connection.c.o' -MF 'libpurple/libpurple@@purple@sha/connection.c.o.d' -o 'libpurple/libpurple@@purple@sha/connection.c.o' -c ../libpurple/connection.c
23-Jan-2019 23:44:31 2019-01-23 18:44:31.075 default/stage-0/default-step-0-0: In file included from ../libpurple/protocol.h:53,
23-Jan-2019 23:44:31 2019-01-23 18:44:31.075 default/stage-0/default-step-0-0:                  from ../libpurple/connection.h:207,
23-Jan-2019 23:44:31 2019-01-23 18:44:31.075 default/stage-0/default-step-0-0:                  from ../libpurple/account.h:53,
23-Jan-2019 23:44:31 2019-01-23 18:44:31.075 default/stage-0/default-step-0-0:                  from ../libpurple/accounts.h:32,
23-Jan-2019 23:44:31 2019-01-23 18:44:31.075 default/stage-0/default-step-0-0:                  from ../libpurple/internal.h:158,
23-Jan-2019 23:44:31 2019-01-23 18:44:31.075 default/stage-0/default-step-0-0:                  from ../libpurple/connection.c:23:
23-Jan-2019 23:44:31 2019-01-23 18:44:31.075 default/stage-0/default-step-0-0: ../libpurple/plugins.h:54:9: error: unknown type name ?GPluginPluginInterface?
23-Jan-2019 23:44:31 2019-01-23 18:44:31.075 default/stage-0/default-step-0-0: typedef GPluginPluginInterface PurplePluginInterface;
23-Jan-2019 23:44:31 2019-01-23 18:44:31.075 default/stage-0/default-step-0-0:          ^~~~~~~~~~~~~~~~~~~~~~
23-Jan-2019 23:44:31 2019-01-23 18:44:31.104 default/stage-0/default-step-0-0: [14/501] Compiling C object 'libpurple/libpurple@@purple@sha/buddy.c.o'.
23-Jan-2019 23:44:31 2019-01-23 18:44:31.104 default/stage-0/default-step-0-0: FAILED: libpurple/libpurple@@purple@sha/buddy.c.o
23-Jan-2019 23:44:31 2019-01-23 18:44:31.104 default/stage-0/default-step-0-0: cc -Ilibpurple/libpurple@@purple@sha -Ilibpurple -I../libpurple -I. -I../ -I/usr/include/glib-2.0 -I/usr/lib/x86_64-linux-gnu/glib-2.0/include -I/usr/include/gplugin-1.0 -I/usr/include/libxml2 -I/usr/include/farstream-0.2 -I/usr/include/gstreamer-1.0 -I/usr/include/orc-0.4 -I/usr/include/json-glib-1.0 -fdiagnostics-color=always -pipe -D_FILE_OFFSET_BITS=64 -Wall -Winvalid-pch -O0 -g -DHAVE_CONFIG_H=1 -DPURPLE_DISABLE_DEPRECATED -DPIDGIN_DISABLE_DEPRECATED -DFINCH_DISABLE_DEPRECATED -DGNT_DISABLE_DEPRECATED -Waggregate-return -Wcast-align -Wdeclaration-after-statement -Wendif-labels -Werror-implicit-function-declaration -Wformat -Wformat-security -Winit-self -Wmissing-declarations -Wmissing-noreturn -Wmissing-prototypes -Wpointer-arith -Wfloat-equal -Wundef -fPIC -pthread  -MD -MQ 'libpurple/libpurple@@purple@sha/buddy.c.o' -MF 'libpurple/libpurple@@purple@sha/buddy.c.o.d' -o 'libpurple/libpurple@@purple@sha/buddy.c.o' -c ../libpurple/buddy.c
23-Jan-2019 23:44:31 2019-01-23 18:44:31.104 default/stage-0/default-step-0-0: In file included from ../libpurple/protocol.h:53,
23-Jan-2019 23:44:31 2019-01-23 18:44:31.104 default/stage-0/default-step-0-0:                  from ../libpurple/connection.h:207,
23-Jan-2019 23:44:31 2019-01-23 18:44:31.104 default/stage-0/default-step-0-0:                  from ../libpurple/account.h:53,
23-Jan-2019 23:44:31 2019-01-23 18:44:31.104 default/stage-0/default-step-0-0:                  from ../libpurple/accounts.h:32,
23-Jan-2019 23:44:31 2019-01-23 18:44:31.104 default/stage-0/default-step-0-0:                  from ../libpurple/internal.h:158,
23-Jan-2019 23:44:31 2019-01-23 18:44:31.104 default/stage-0/default-step-0-0:                  from ../libpurple/buddy.c:23:
23-Jan-2019 23:44:31 2019-01-23 18:44:31.104 default/stage-0/default-step-0-0: ../libpurple/plugins.h:54:9: error: unknown type name ?GPluginPluginInterface?
23-Jan-2019 23:44:31 2019-01-23 18:44:31.104 default/stage-0/default-step-0-0: typedef GPluginPluginInterface PurplePluginInterface;
23-Jan-2019 23:44:31 2019-01-23 18:44:31.104 default/stage-0/default-step-0-0:          ^~~~~~~~~~~~~~~~~~~~~~
23-Jan-2019 23:44:31 2019-01-23 18:44:31.105 default/stage-0/default-step-0-0: [15/501] Compiling C object 'libpurple/libpurple@@purple@sha/conversation.c.o'.
23-Jan-2019 23:44:31 2019-01-23 18:44:31.105 default/stage-0/default-step-0-0: FAILED: libpurple/libpurple@@purple@sha/conversation.c.o
23-Jan-2019 23:44:31 2019-01-23 18:44:31.105 default/stage-0/default-step-0-0: cc -Ilibpurple/libpurple@@purple@sha -Ilibpurple -I../libpurple -I. -I../ -I/usr/include/glib-2.0 -I/usr/lib/x86_64-linux-gnu/glib-2.0/include -I/usr/include/gplugin-1.0 -I/usr/include/libxml2 -I/usr/include/farstream-0.2 -I/usr/include/gstreamer-1.0 -I/usr/include/orc-0.4 -I/usr/include/json-glib-1.0 -fdiagnostics-color=always -pipe -D_FILE_OFFSET_BITS=64 -Wall -Winvalid-pch -O0 -g -DHAVE_CONFIG_H=1 -DPURPLE_DISABLE_DEPRECATED -DPIDGIN_DISABLE_DEPRECATED -DFINCH_DISABLE_DEPRECATED -DGNT_DISABLE_DEPRECATED -Waggregate-return -Wcast-align -Wdeclaration-after-statement -Wendif-labels -Werror-implicit-function-declaration -Wformat -Wformat-security -Winit-self -Wmissing-declarations -Wmissing-noreturn -Wmissing-prototypes -Wpointer-arith -Wfloat-equal -Wundef -fPIC -pthread  -MD -MQ 'libpurple/libpurple@@purple@sha/conversation.c.o' -MF 'libpurple/libpurple@@purple@sha/conversation.c.o.d' -o 'libpurple/libpurple@@purple@sha/conversation.c.o' -c ../libpurple/conversation.c
23-Jan-2019 23:44:31 2019-01-23 18:44:31.105 default/stage-0/default-step-0-0: In file included from ../libpurple/protocol.h:53,
23-Jan-2019 23:44:31 2019-01-23 18:44:31.105 default/stage-0/default-step-0-0:                  from ../libpurple/connection.h:207,
23-Jan-2019 23:44:31 2019-01-23 18:44:31.105 default/stage-0/default-step-0-0:                  from ../libpurple/account.h:53,
23-Jan-2019 23:44:31 2019-01-23 18:44:31.105 default/stage-0/default-step-0-0:                  from ../libpurple/accounts.h:32,
23-Jan-2019 23:44:31 2019-01-23 18:44:31.105 default/stage-0/default-step-0-0:                  from ../libpurple/internal.h:158,
23-Jan-2019 23:44:31 2019-01-23 18:44:31.105 default/stage-0/default-step-0-0:                  from ../libpurple/conversation.c:22:
23-Jan-2019 23:44:31 2019-01-23 18:44:31.105 default/stage-0/default-step-0-0: ../libpurple/plugins.h:54:9: error: unknown type name ?GPluginPluginInterface?
23-Jan-2019 23:44:31 2019-01-23 18:44:31.105 default/stage-0/default-step-0-0: typedef GPluginPluginInterface PurplePluginInterface;
23-Jan-2019 23:44:31 2019-01-23 18:44:31.105 default/stage-0/default-step-0-0:          ^~~~~~~~~~~~~~~~~~~~~~
23-Jan-2019 23:44:31 2019-01-23 18:44:31.106 default/stage-0/default-step-0-0: [16/501] Compiling C object 'libpurple/libpurple@@purple@sha/buddylist.c.o'.
23-Jan-2019 23:44:31 2019-01-23 18:44:31.106 default/stage-0/default-step-0-0: FAILED: libpurple/libpurple@@purple@sha/buddylist.c.o
23-Jan-2019 23:44:31 2019-01-23 18:44:31.106 default/stage-0/default-step-0-0: cc -Ilibpurple/libpurple@@purple@sha -Ilibpurple -I../libpurple -I. -I../ -I/usr/include/glib-2.0 -I/usr/lib/x86_64-linux-gnu/glib-2.0/include -I/usr/include/gplugin-1.0 -I/usr/include/libxml2 -I/usr/include/farstream-0.2 -I/usr/include/gstreamer-1.0 -I/usr/include/orc-0.4 -I/usr/include/json-glib-1.0 -fdiagnostics-color=always -pipe -D_FILE_OFFSET_BITS=64 -Wall -Winvalid-pch -O0 -g -DHAVE_CONFIG_H=1 -DPURPLE_DISABLE_DEPRECATED -DPIDGIN_DISABLE_DEPRECATED -DFINCH_DISABLE_DEPRECATED -DGNT_DISABLE_DEPRECATED -Waggregate-return -Wcast-align -Wdeclaration-after-statement -Wendif-labels -Werror-implicit-function-declaration -Wformat -Wformat-security -Winit-self -Wmissing-declarations -Wmissing-noreturn -Wmissing-prototypes -Wpointer-arith -Wfloat-equal -Wundef -fPIC -pthread  -MD -MQ 'libpurple/libpurple@@purple@sha/buddylist.c.o' -MF 'libpurple/libpurple@@purple@sha/buddylist.c.o.d' -o 'libpurple/libpurple@@purple@sha/buddylist.c.o' -c ../libpurple/buddylist.c
23-Jan-2019 23:44:31 2019-01-23 18:44:31.106 default/stage-0/default-step-0-0: In file included from ../libpurple/protocol.h:53,
23-Jan-2019 23:44:31 2019-01-23 18:44:31.106 default/stage-0/default-step-0-0:                  from ../libpurple/connection.h:207,
23-Jan-2019 23:44:31 2019-01-23 18:44:31.106 default/stage-0/default-step-0-0:                  from ../libpurple/account.h:53,
23-Jan-2019 23:44:31 2019-01-23 18:44:31.106 default/stage-0/default-step-0-0:                  from ../libpurple/accounts.h:32,
23-Jan-2019 23:44:31 2019-01-23 18:44:31.106 default/stage-0/default-step-0-0:                  from ../libpurple/internal.h:158,
23-Jan-2019 23:44:31 2019-01-23 18:44:31.106 default/stage-0/default-step-0-0:                  from ../libpurple/buddylist.c:23:
23-Jan-2019 23:44:31 2019-01-23 18:44:31.106 default/stage-0/default-step-0-0: ../libpurple/plugins.h:54:9: error: unknown type name ?GPluginPluginInterface?
23-Jan-2019 23:44:31 2019-01-23 18:44:31.106 default/stage-0/default-step-0-0: typedef GPluginPluginInterface PurplePluginInterface;
23-Jan-2019 23:44:31 2019-01-23 18:44:31.106 default/stage-0/default-step-0-0:          ^~~~~~~~~~~~~~~~~~~~~~
23-Jan-2019 23:44:31 2019-01-23 18:44:31.119 default/stage-0/default-step-0-0: [17/501] Compiling C object 'libpurple/libpurple@@purple@sha/account.c.o'.
23-Jan-2019 23:44:31 2019-01-23 18:44:31.119 default/stage-0/default-step-0-0: FAILED: libpurple/libpurple@@purple@sha/account.c.o
23-Jan-2019 23:44:31 2019-01-23 18:44:31.119 default/stage-0/default-step-0-0: cc -Ilibpurple/libpurple@@purple@sha -Ilibpurple -I../libpurple -I. -I../ -I/usr/include/glib-2.0 -I/usr/lib/x86_64-linux-gnu/glib-2.0/include -I/usr/include/gplugin-1.0 -I/usr/include/libxml2 -I/usr/include/farstream-0.2 -I/usr/include/gstreamer-1.0 -I/usr/include/orc-0.4 -I/usr/include/json-glib-1.0 -fdiagnostics-color=always -pipe -D_FILE_OFFSET_BITS=64 -Wall -Winvalid-pch -O0 -g -DHAVE_CONFIG_H=1 -DPURPLE_DISABLE_DEPRECATED -DPIDGIN_DISABLE_DEPRECATED -DFINCH_DISABLE_DEPRECATED -DGNT_DISABLE_DEPRECATED -Waggregate-return -Wcast-align -Wdeclaration-after-statement -Wendif-labels -Werror-implicit-function-declaration -Wformat -Wformat-security -Winit-self -Wmissing-declarations -Wmissing-noreturn -Wmissing-prototypes -Wpointer-arith -Wfloat-equal -Wundef -fPIC -pthread  -MD -MQ 'libpurple/libpurple@@purple@sha/account.c.o' -MF 'libpurple/libpurple@@purple@sha/account.c.o.d' -o 'libpurple/libpurple@@purple@sha/account.c.o' -c ../libpurple/account.c
23-Jan-2019 23:44:31 2019-01-23 18:44:31.119 default/stage-0/default-step-0-0: In file included from ../libpurple/protocol.h:53,
23-Jan-2019 23:44:31 2019-01-23 18:44:31.119 default/stage-0/default-step-0-0:                  from ../libpurple/connection.h:207,
23-Jan-2019 23:44:31 2019-01-23 18:44:31.119 default/stage-0/default-step-0-0:                  from ../libpurple/account.h:53,
23-Jan-2019 23:44:31 2019-01-23 18:44:31.119 default/stage-0/default-step-0-0:                  from ../libpurple/accounts.h:32,
23-Jan-2019 23:44:31 2019-01-23 18:44:31.119 default/stage-0/default-step-0-0:                  from ../libpurple/internal.h:158,
23-Jan-2019 23:44:31 2019-01-23 18:44:31.119 default/stage-0/default-step-0-0:                  from ../libpurple/account.c:21:
23-Jan-2019 23:44:31 2019-01-23 18:44:31.119 default/stage-0/default-step-0-0: ../libpurple/plugins.h:54:9: error: unknown type name ?GPluginPluginInterface?
23-Jan-2019 23:44:31 2019-01-23 18:44:31.119 default/stage-0/default-step-0-0: typedef GPluginPluginInterface PurplePluginInterface;
23-Jan-2019 23:44:31 2019-01-23 18:44:31.119 default/stage-0/default-step-0-0:          ^~~~~~~~~~~~~~~~~~~~~~
23-Jan-2019 23:44:31 2019-01-23 18:44:31.142 default/stage-0/default-step-0-0: [18/501] Compiling C object 'libpurple/libpurple@@purple@sha/contact.c.o'.
23-Jan-2019 23:44:31 2019-01-23 18:44:31.142 default/stage-0/default-step-0-0: FAILED: libpurple/libpurple@@purple@sha/contact.c.o
23-Jan-2019 23:44:31 2019-01-23 18:44:31.142 default/stage-0/default-step-0-0: cc -Ilibpurple/libpurple@@purple@sha -Ilibpurple -I../libpurple -I. -I../ -I/usr/include/glib-2.0 -I/usr/lib/x86_64-linux-gnu/glib-2.0/include -I/usr/include/gplugin-1.0 -I/usr/include/libxml2 -I/usr/include/farstream-0.2 -I/usr/include/gstreamer-1.0 -I/usr/include/orc-0.4 -I/usr/include/json-glib-1.0 -fdiagnostics-color=always -pipe -D_FILE_OFFSET_BITS=64 -Wall -Winvalid-pch -O0 -g -DHAVE_CONFIG_H=1 -DPURPLE_DISABLE_DEPRECATED -DPIDGIN_DISABLE_DEPRECATED -DFINCH_DISABLE_DEPRECATED -DGNT_DISABLE_DEPRECATED -Waggregate-return -Wcast-align -Wdeclaration-after-statement -Wendif-labels -Werror-implicit-function-declaration -Wformat -Wformat-security -Winit-self -Wmissing-declarations -Wmissing-noreturn -Wmissing-prototypes -Wpointer-arith -Wfloat-equal -Wundef -fPIC -pthread  -MD -MQ 'libpurple/libpurple@@purple@sha/contact.c.o' -MF 'libpurple/libpurple@@purple@sha/contact.c.o.d' -o 'libpurple/libpurple@@purple@sha/contact.c.o' -c ../libpurple/contact.c
23-Jan-2019 23:44:31 2019-01-23 18:44:31.142 default/stage-0/default-step-0-0: In file included from ../libpurple/protocol.h:53,
23-Jan-2019 23:44:31 2019-01-23 18:44:31.142 default/stage-0/default-step-0-0:                  from ../libpurple/connection.h:207,
23-Jan-2019 23:44:31 2019-01-23 18:44:31.142 default/stage-0/default-step-0-0:                  from ../libpurple/account.h:53,
23-Jan-2019 23:44:31 2019-01-23 18:44:31.142 default/stage-0/default-step-0-0:                  from ../libpurple/group.h:43,
23-Jan-2019 23:44:31 2019-01-23 18:44:31.142 default/stage-0/default-step-0-0:                  from ../libpurple/contact.h:42,
23-Jan-2019 23:44:31 2019-01-23 18:44:31.142 default/stage-0/default-step-0-0:                  from ../libpurple/contact.c:24:
23-Jan-2019 23:44:31 2019-01-23 18:44:31.142 default/stage-0/default-step-0-0: ../libpurple/plugins.h:54:9: error: unknown type name ?GPluginPluginInterface?
23-Jan-2019 23:44:31 2019-01-23 18:44:31.142 default/stage-0/default-step-0-0: typedef GPluginPluginInterface PurplePluginInterface;
23-Jan-2019 23:44:31 2019-01-23 18:44:31.142 default/stage-0/default-step-0-0:          ^~~~~~~~~~~~~~~~~~~~~~
23-Jan-2019 23:44:31 2019-01-23 18:44:31.151 default/stage-0/default-step-0-0: [19/501] Compiling C object 'libpurple/libpurple@@purple@sha/conversationtypes.c.o'.
23-Jan-2019 23:44:31 2019-01-23 18:44:31.151 default/stage-0/default-step-0-0: FAILED: libpurple/libpurple@@purple@sha/conversationtypes.c.o
23-Jan-2019 23:44:31 2019-01-23 18:44:31.151 default/stage-0/default-step-0-0: cc -Ilibpurple/libpurple@@purple@sha -Ilibpurple -I../libpurple -I. -I../ -I/usr/include/glib-2.0 -I/usr/lib/x86_64-linux-gnu/glib-2.0/include -I/usr/include/gplugin-1.0 -I/usr/include/libxml2 -I/usr/include/farstream-0.2 -I/usr/include/gstreamer-1.0 -I/usr/include/orc-0.4 -I/usr/include/json-glib-1.0 -fdiagnostics-color=always -pipe -D_FILE_OFFSET_BITS=64 -Wall -Winvalid-pch -O0 -g -DHAVE_CONFIG_H=1 -DPURPLE_DISABLE_DEPRECATED -DPIDGIN_DISABLE_DEPRECATED -DFINCH_DISABLE_DEPRECATED -DGNT_DISABLE_DEPRECATED -Waggregate-return -Wcast-align -Wdeclaration-after-statement -Wendif-labels -Werror-implicit-function-declaration -Wformat -Wformat-security -Winit-self -Wmissing-declarations -Wmissing-noreturn -Wmissing-prototypes -Wpointer-arith -Wfloat-equal -Wundef -fPIC -pthread  -MD -MQ 'libpurple/libpurple@@purple@sha/conversationtypes.c.o' -MF 'libpurple/libpurple@@purple@sha/conversationtypes.c.o.d' -o 'libpurple/libpurple@@purple@sha/conversationtypes.c.o' -c ../libpurple/conversationtypes.c
23-Jan-2019 23:44:31 2019-01-23 18:44:31.151 default/stage-0/default-step-0-0: In file included from ../libpurple/protocol.h:53,
23-Jan-2019 23:44:31 2019-01-23 18:44:31.151 default/stage-0/default-step-0-0:                  from ../libpurple/connection.h:207,
23-Jan-2019 23:44:31 2019-01-23 18:44:31.151 default/stage-0/default-step-0-0:                  from ../libpurple/account.h:53,
23-Jan-2019 23:44:31 2019-01-23 18:44:31.151 default/stage-0/default-step-0-0:                  from ../libpurple/accounts.h:32,
23-Jan-2019 23:44:31 2019-01-23 18:44:31.151 default/stage-0/default-step-0-0:                  from ../libpurple/internal.h:158,
23-Jan-2019 23:44:31 2019-01-23 18:44:31.151 default/stage-0/default-step-0-0:                  from ../libpurple/conversationtypes.c:22:
23-Jan-2019 23:44:31 2019-01-23 18:44:31.151 default/stage-0/default-step-0-0: ../libpurple/plugins.h:54:9: error: unknown type name ?GPluginPluginInterface?
23-Jan-2019 23:44:31 2019-01-23 18:44:31.151 default/stage-0/default-step-0-0: typedef GPluginPluginInterface PurplePluginInterface;
23-Jan-2019 23:44:31 2019-01-23 18:44:31.151 default/stage-0/default-step-0-0:          ^~~~~~~~~~~~~~~~~~~~~~
23-Jan-2019 23:44:31 2019-01-23 18:44:31.166 default/stage-0/default-step-0-0: [20/501] Compiling C object 'libpurple/libpurple@@purple@sha/circularbuffer.c.o'.
23-Jan-2019 23:44:31 2019-01-23 18:44:31.166 default/stage-0/default-step-0-0: FAILED: libpurple/libpurple@@purple@sha/circularbuffer.c.o
23-Jan-2019 23:44:31 2019-01-23 18:44:31.166 default/stage-0/default-step-0-0: cc -Ilibpurple/libpurple@@purple@sha -Ilibpurple -I../libpurple -I. -I../ -I/usr/include/glib-2.0 -I/usr/lib/x86_64-linux-gnu/glib-2.0/include -I/usr/include/gplugin-1.0 -I/usr/include/libxml2 -I/usr/include/farstream-0.2 -I/usr/include/gstreamer-1.0 -I/usr/include/orc-0.4 -I/usr/include/json-glib-1.0 -fdiagnostics-color=always -pipe -D_FILE_OFFSET_BITS=64 -Wall -Winvalid-pch -O0 -g -DHAVE_CONFIG_H=1 -DPURPLE_DISABLE_DEPRECATED -DPIDGIN_DISABLE_DEPRECATED -DFINCH_DISABLE_DEPRECATED -DGNT_DISABLE_DEPRECATED -Waggregate-return -Wcast-align -Wdeclaration-after-statement -Wendif-labels -Werror-implicit-function-declaration -Wformat -Wformat-security -Winit-self -Wmissing-declarations -Wmissing-noreturn -Wmissing-prototypes -Wpointer-arith -Wfloat-equal -Wundef -fPIC -pthread  -MD -MQ 'libpurple/libpurple@@purple@sha/circularbuffer.c.o' -MF 'libpurple/libpurple@@purple@sha/circularbuffer.c.o.d' -o 'libpurple/libpurple@@purple@sha/circularbuffer.c.o' -c ../libpurple/circularbuffer.c
23-Jan-2019 23:44:31 2019-01-23 18:44:31.166 default/stage-0/default-step-0-0: In file included from ../libpurple/protocol.h:53,
23-Jan-2019 23:44:31 2019-01-23 18:44:31.166 default/stage-0/default-step-0-0:                  from ../libpurple/connection.h:207,
23-Jan-2019 23:44:31 2019-01-23 18:44:31.166 default/stage-0/default-step-0-0:                  from ../libpurple/account.h:53,
23-Jan-2019 23:44:31 2019-01-23 18:44:31.166 default/stage-0/default-step-0-0:                  from ../libpurple/accounts.h:32,
23-Jan-2019 23:44:31 2019-01-23 18:44:31.166 default/stage-0/default-step-0-0:                  from ../libpurple/internal.h:158,
23-Jan-2019 23:44:31 2019-01-23 18:44:31.166 default/stage-0/default-step-0-0:                  from ../libpurple/circularbuffer.c:19:
23-Jan-2019 23:44:31 2019-01-23 18:44:31.166 default/stage-0/default-step-0-0: ../libpurple/plugins.h:54:9: error: unknown type name ?GPluginPluginInterface?
23-Jan-2019 23:44:31 2019-01-23 18:44:31.166 default/stage-0/default-step-0-0: typedef GPluginPluginInterface PurplePluginInterface;
23-Jan-2019 23:44:31 2019-01-23 18:44:31.166 default/stage-0/default-step-0-0:          ^~~~~~~~~~~~~~~~~~~~~~
23-Jan-2019 23:44:31 2019-01-23 18:44:31.175 default/stage-0/default-step-0-0: [21/501] Compiling C object 'libpurple/libpurple@@purple@sha/chat.c.o'.
23-Jan-2019 23:44:31 2019-01-23 18:44:31.175 default/stage-0/default-step-0-0: FAILED: libpurple/libpurple@@purple@sha/chat.c.o
23-Jan-2019 23:44:31 2019-01-23 18:44:31.175 default/stage-0/default-step-0-0: cc -Ilibpurple/libpurple@@purple@sha -Ilibpurple -I../libpurple -I. -I../ -I/usr/include/glib-2.0 -I/usr/lib/x86_64-linux-gnu/glib-2.0/include -I/usr/include/gplugin-1.0 -I/usr/include/libxml2 -I/usr/include/farstream-0.2 -I/usr/include/gstreamer-1.0 -I/usr/include/orc-0.4 -I/usr/include/json-glib-1.0 -fdiagnostics-color=always -pipe -D_FILE_OFFSET_BITS=64 -Wall -Winvalid-pch -O0 -g -DHAVE_CONFIG_H=1 -DPURPLE_DISABLE_DEPRECATED -DPIDGIN_DISABLE_DEPRECATED -DFINCH_DISABLE_DEPRECATED -DGNT_DISABLE_DEPRECATED -Waggregate-return -Wcast-align -Wdeclaration-after-statement -Wendif-labels -Werror-implicit-function-declaration -Wformat -Wformat-security -Winit-self -Wmissing-declarations -Wmissing-noreturn -Wmissing-prototypes -Wpointer-arith -Wfloat-equal -Wundef -fPIC -pthread  -MD -MQ 'libpurple/libpurple@@purple@sha/chat.c.o' -MF 'libpurple/libpurple@@purple@sha/chat.c.o.d' -o 'libpurple/libpurple@@purple@sha/chat.c.o' -c ../libpurple/chat.c
23-Jan-2019 23:44:31 2019-01-23 18:44:31.175 default/stage-0/default-step-0-0: In file included from ../libpurple/protocol.h:53,
23-Jan-2019 23:44:31 2019-01-23 18:44:31.175 default/stage-0/default-step-0-0:                  from ../libpurple/connection.h:207,
23-Jan-2019 23:44:31 2019-01-23 18:44:31.175 default/stage-0/default-step-0-0:                  from ../libpurple/account.h:53,
23-Jan-2019 23:44:31 2019-01-23 18:44:31.175 default/stage-0/default-step-0-0:                  from ../libpurple/accounts.h:32,
23-Jan-2019 23:44:31 2019-01-23 18:44:31.175 default/stage-0/default-step-0-0:                  from ../libpurple/internal.h:158,
23-Jan-2019 23:44:31 2019-01-23 18:44:31.175 default/stage-0/default-step-0-0:                  from ../libpurple/chat.c:23:
23-Jan-2019 23:44:31 2019-01-23 18:44:31.175 default/stage-0/default-step-0-0: ../libpurple/plugins.h:54:9: error: unknown type name ?GPluginPluginInterface?
23-Jan-2019 23:44:31 2019-01-23 18:44:31.175 default/stage-0/default-step-0-0: typedef GPluginPluginInterface PurplePluginInterface;
23-Jan-2019 23:44:31 2019-01-23 18:44:31.175 default/stage-0/default-step-0-0:          ^~~~~~~~~~~~~~~~~~~~~~
23-Jan-2019 23:44:31 2019-01-23 18:44:31.584 default/stage-0/default-step-0-0: [22/501] Generating enums.c with a meson_exe.py custom command.
23-Jan-2019 23:44:34 2019-01-23 18:44:34.517 default/stage-0/default-step-0-0: [23/501] Generating im.pidgin.Pidgin.desktop_merge with a custom command.
23-Jan-2019 23:44:34 2019-01-23 18:44:34.626 default/stage-0/default-step-0-0: [24/501] Generating im.pidgin.Pidgin.appdata.xml_merge with a custom command.
23-Jan-2019 23:44:34 2019-01-23 18:44:34.626 default/stage-0/default-step-0-0: ninja: build stopped: subcommand failed.
23-Jan-2019 23:44:35 2019-01-23 18:44:35.862 default/stage-0/default-step-0-0: failed, exit status 1
23-Jan-2019 23:44:35 2019-01-23 18:44:35.862 default/stage-0: stage failed
23-Jan-2019 23:44:35 2019-01-23 18:44:35.862 default: removing workspace 8a4713b0-2d30-4f24-9ba4-109826a58d6d
23-Jan-2019 23:44:36 2019-01-23 18:44:36.421 remove workspace: 8a4713b0-2d30-4f24-9ba4-109826a58d6d
23-Jan-2019 23:44:36 2019-01-23 18:44:36.426 default: removed workspace 8a4713b0-2d30-4f24-9ba4-109826a58d6d
23-Jan-2019 23:44:36 2019-01-23 18:44:36.426 default: removing network c63c1cfe-355d-43ab-b71b-c9438b9c3961
23-Jan-2019 23:44:37 2019-01-23 18:44:37.202 remove network: c63c1cfe-355d-43ab-b71b-c9438b9c3961
23-Jan-2019 23:44:37 2019-01-23 18:44:37.206 default: removed network c63c1cfe-355d-43ab-b71b-c9438b9c3961
23-Jan-2019 23:44:37 2019-01-23 18:44:37.206 convey-runner: exit status 1
23-Jan-2019 23:44:37 Failing task since return code of [/opt/atlassian/bamboo/agent-home/temp/PGN-MAIK-JOB1-232-ScriptBuildTask-8314375982089626720.sh] was 1 while expected 0
23-Jan-2019 23:44:37 Finished task 'Run bitbucket pipelines' with result: Failed
23-Jan-2019 23:44:37 Running post build plugin 'Docker Container Cleanup'
23-Jan-2019 23:44:37 Running post build plugin 'NCover Results Collector'
23-Jan-2019 23:44:37 Running post build plugin 'Clover Results Collector'
23-Jan-2019 23:44:37 Running post build plugin 'npm Cache Cleanup'
23-Jan-2019 23:44:37 Running post build plugin 'Artifact Copier'
23-Jan-2019 23:44:37 Finalising the build...
23-Jan-2019 23:44:37 Stopping timer.
23-Jan-2019 23:44:37 Build PGN-MAIK-JOB1-232 completed.
23-Jan-2019 23:44:37 Running on server: post build plugin 'NCover Results Collector'
23-Jan-2019 23:44:37 Running on server: post build plugin 'Build Hanging Detection Configuration'
23-Jan-2019 23:44:37 Running on server: post build plugin 'Clover Delta Calculator'
23-Jan-2019 23:44:37 Running on server: post build plugin 'Maven Dependencies Postprocessor'
23-Jan-2019 23:44:37 All post build plugins have finished
23-Jan-2019 23:44:37 Generating build results summary...
23-Jan-2019 23:44:37 Saving build results to disk...
23-Jan-2019 23:44:37 Logging substituted variables...
23-Jan-2019 23:44:37 Indexing build results...
23-Jan-2019 23:44:37 Finished building PGN-MAIK-JOB1-232.