Build: #233 failed

Job: Default Job failed

Stages & jobs

  1. Default Stage

Build log

The build generated 840 lines of output. Download or view full build log

24-Jan-2019 05:56:23 Build Pidgin - cmaiku - Default Job #233 (PGN-MAIK-JOB1-233) started building on agent atlantis.internal.rekkanoryo.net
24-Jan-2019 05:56:23 Remote agent on host atlantis.internal.rekkanoryo.net
24-Jan-2019 05:56:23 Build working directory is /opt/atlassian/bamboo/agent-home/xml-data/build-dir/PGN-MAIK-JOB1
24-Jan-2019 05:56:23 Executing build Pidgin - cmaiku - Default Job #233 (PGN-MAIK-JOB1-233)
24-Jan-2019 05:56:23 Starting task 'Checkout Default Repository' of type 'com.atlassian.bamboo.plugins.vcs:task.vcs.checkout'
24-Jan-2019 05:56:23 Checking out into /opt/atlassian/bamboo/agent-home/xml-data/build-dir/PGN-MAIK-JOB1
24-Jan-2019 05:56:23 Updating source code to revision: a470dea578c524053fa6086795e226923fd23a26
24-Jan-2019 05:56:23 Retrieving source from remote repository...
24-Jan-2019 05:56:23 Pulling from repository [https://rw_grim:********@bitbucket.org/CMaiku/pidgin] to directory '/opt/atlassian/bamboo/agent-home/xml-data/build-dir/_hg-repositories-cache/d1bacfbc3865ab1d729762e37fb4ff17d17ff56c' revision `a470dea578c524053fa6086795e226923fd23a26'
24-Jan-2019 05:56:24 pulling from https://rw_grim:***@bitbucket.org/CMaiku/pidgin
24-Jan-2019 05:56:24 searching for changes
24-Jan-2019 05:56:24 adding changesets
24-Jan-2019 05:56:24 adding manifests
24-Jan-2019 05:56:24 adding file changes
24-Jan-2019 05:56:24 added 1 changesets with 1 changes to 1 files
24-Jan-2019 05:56:24 updating bookmark port-to-new-gplugin
24-Jan-2019 05:56:24 new changesets a470dea578c5 (1 drafts)
24-Jan-2019 05:56:24 (run 'hg update' to get a working copy)
24-Jan-2019 05:56:24 Obtaining remote repository to agent's cache directory '/opt/atlassian/bamboo/agent-home/xml-data/build-dir/_hg-repositories-cache/d1bacfbc3865ab1d729762e37fb4ff17d17ff56c'...
24-Jan-2019 05:56:24 Pulling from repository [/opt/atlassian/bamboo/agent-home/xml-data/build-dir/_hg-repositories-cache/d1bacfbc3865ab1d729762e37fb4ff17d17ff56c] to directory '/opt/atlassian/bamboo/agent-home/xml-data/build-dir/PGN-MAIK-JOB1' revision `a470dea578c524053fa6086795e226923fd23a26'
24-Jan-2019 05:56:24 pulling from /opt/atlassian/bamboo/agent-home/xml-data/build-dir/_hg-repositories-cache/d1bacfbc3865ab1d729762e37fb4ff17d17ff56c
24-Jan-2019 05:56:24 searching for changes
24-Jan-2019 05:56:24 adding changesets
24-Jan-2019 05:56:24 adding manifests
24-Jan-2019 05:56:24 adding file changes
24-Jan-2019 05:56:24 added 1 changesets with 1 changes to 1 files
24-Jan-2019 05:56:24 updating bookmark port-to-new-gplugin
24-Jan-2019 05:56:24 new changesets a470dea578c5
24-Jan-2019 05:56:24 (run 'hg update' to get a working copy)
24-Jan-2019 05:56:25 1 files updated, 0 files merged, 0 files removed, 0 files unresolved
24-Jan-2019 05:56:25 Updated source code to revision: a470dea578c524053fa6086795e226923fd23a26
24-Jan-2019 05:56:25 Finished task 'Checkout Default Repository' with result: Success
24-Jan-2019 05:56:25 Running pre-build action: VCS Version Collector
24-Jan-2019 05:56:25 Starting task 'Run bitbucket pipelines' of type 'com.atlassian.bamboo.plugins.scripttask:task.builder.script'
24-Jan-2019 05:56:25
Beginning to execute external process for build 'Pidgin - cmaiku - Default Job #233 (PGN-MAIK-JOB1-233)'
... running command line:
/opt/atlassian/bamboo/agent-home/temp/PGN-MAIK-JOB1-233-ScriptBuildTask-9119326056014057855.sh
... in: /opt/atlassian/bamboo/agent-home/xml-data/build-dir/PGN-MAIK-JOB1
... using extra environment variables:
bamboo_planRepository_1_branch=default
bamboo_repository_3014659_revision_number=a470dea578c524053fa6086795e226923fd23a26
bamboo_planRepository_1_branchDisplayName=default
bamboo_GRIM_DOCKERHUB_PASSWORD=********
bamboo_repository_revision_number=a470dea578c524053fa6086795e226923fd23a26
bamboo_resultsUrl=https://bamboo.pidgin.im/browse/PGN-MAIK-JOB1-233
bamboo_build_working_directory=/opt/atlassian/bamboo/agent-home/xml-data/build-dir/PGN-MAIK-JOB1
bamboo_planRepository_1_name=bitbucket.org/CMaiku/pidgin
bamboo_buildKey=PGN-MAIK-JOB1
bamboo_capability_system_builder_command_Convey=/usr/local/bin/convey
bamboo_shortPlanName=cmaiku
bamboo_planRepository_name=bitbucket.org/CMaiku/pidgin
bamboo_buildNumber=233
bamboo_shortJobName=Default Job
bamboo_buildResultsUrl=https://bamboo.pidgin.im/browse/PGN-MAIK-JOB1-233
bamboo_planRepository_repositoryUrl=https://bitbucket.org/CMaiku/pidgin
bamboo_agentId=6160385
bamboo_planName=Pidgin - cmaiku
bamboo_shortPlanKey=MAIK
bamboo_shortJobKey=JOB1
bamboo_planRepository_revision=a470dea578c524053fa6086795e226923fd23a26
bamboo_repository_3014659_branch_name=default
bamboo_buildTimeStamp=2019-01-24T05:56:22.540Z
bamboo_repository_previous_revision_number=92213bd9538bfde870103f66b027ac9889e8a62c
bamboo_planRepository_previousRevision=92213bd9538bfde870103f66b027ac9889e8a62c
bamboo_buildResultKey=PGN-MAIK-JOB1-233
bamboo_repository_branch_name=default
bamboo_buildPlanName=Pidgin - cmaiku - Default Job
bamboo_planRepository_1_revision=a470dea578c524053fa6086795e226923fd23a26
bamboo_capability_system_hg_executable=/usr/bin/hg
bamboo_capability_agent_Name=bamboo-at
bamboo_repository_name=bitbucket.org/CMaiku/pidgin
bamboo_buildFailed=false
bamboo_capability_system_docker_executable=/usr/bin/docker
bamboo_planRepository_branch=default
bamboo_agentWorkingDirectory=/opt/atlassian/bamboo/agent-home/xml-data/build-dir
bamboo_capability_system_git_executable=/usr/bin/git
bamboo_planRepository_1_previousRevision=92213bd9538bfde870103f66b027ac9889e8a62c
bamboo_planRepository_branchDisplayName=default
bamboo_planRepository_1_type=bbCloud
bamboo_planRepository_branchName=default
bamboo_GRIM_PVS_STUDIO_USERNAME=grim@reaperworld.com
bamboo_capability_system_jdk_JDK=/usr/lib/jvm/jdk1.8.0_162
bamboo_plan_storageTag=plan-2850819
bamboo_GRIM_DOCKERHUB_USERNAME=rwgrim
bamboo_hg_cache_directory=/opt/atlassian/bamboo/agent-home/xml-data/build-dir/_hg-repositories-cache
bamboo_planRepository_1_username=rw_grim
bamboo_planRepository_type=bbCloud
bamboo_git_cache_directory=/opt/atlassian/bamboo/agent-home/xml-data/build-dir/_git-repositories-cache
bamboo_tmp_directory=/opt/atlassian/bamboo/agent-home/temp
bamboo_working_directory=/opt/atlassian/bamboo/agent-home/xml-data/build-dir/PGN-MAIK-JOB1
bamboo_planKey=PGN-MAIK
bamboo_repository_3014659_name=bitbucket.org/CMaiku/pidgin
bamboo_planRepository_1_repositoryUrl=https://bitbucket.org/CMaiku/pidgin
bamboo_GRIM_PACKAGECLOUD_TOKEN_SECRET=********
bamboo_planRepository_username=rw_grim
bamboo_GRIM_PVS_STUDIO_KEY_SECRET=********
bamboo_capability_system_jdk_JDK_1_8=/usr/lib/jvm/jdk1.8.0_162
bamboo_capability_system_jdk_JDK_1_8_0_162=/usr/lib/jvm/jdk1.8.0_162
bamboo_repository_3014659_previous_revision_number=92213bd9538bfde870103f66b027ac9889e8a62c
bamboo_planRepository_1_branchName=default
24-Jan-2019 05:56:26 2019-01-24 00:56:26.188 default: creating network...
24-Jan-2019 05:56:26 2019-01-24 00:56:26.796 default: created network b0e790d8-a321-40c0-b729-e2fecabda44c
24-Jan-2019 05:56:26 2019-01-24 00:56:26.796 default: creating workspace...
24-Jan-2019 05:56:27 2019-01-24 00:56:27.922 default: created workspace e5b3d926-1f2a-4cd7-a8e9-d313fd1de103
24-Jan-2019 05:56:27 2019-01-24 00:56:27.922 default/stage-0: stage starting
24-Jan-2019 05:56:27 2019-01-24 00:56:27.922 default/stage-0/import: starting
24-Jan-2019 05:56:33 2019-01-24 00:56:33.815 default/stage-0/import: finished
24-Jan-2019 05:56:33 2019-01-24 00:56:33.815 default/stage-0/default-step-0-0: starting
24-Jan-2019 05:56:33 2019-01-24 00:56:33.816 default/stage-0/default-step-0-0: running container with id 5e69a4
24-Jan-2019 05:56:35 2019-01-24 00:56:35.480 default/stage-0/default-step-0-0: + hg clone https://bitbucket.org/pidgin/talkatu
24-Jan-2019 05:56:36 2019-01-24 00:56:36.555 default/stage-0/default-step-0-0: destination directory: talkatu
24-Jan-2019 05:56:36 2019-01-24 00:56:36.555 default/stage-0/default-step-0-0: requesting all changes
24-Jan-2019 05:56:36 2019-01-24 00:56:36.555 default/stage-0/default-step-0-0: adding changesets
24-Jan-2019 05:56:36 2019-01-24 00:56:36.555 default/stage-0/default-step-0-0: adding manifests
24-Jan-2019 05:56:36 2019-01-24 00:56:36.555 default/stage-0/default-step-0-0: adding file changes
24-Jan-2019 05:56:36 2019-01-24 00:56:36.555 default/stage-0/default-step-0-0: added 216 changesets with 722 changes to 158 files
24-Jan-2019 05:56:36 2019-01-24 00:56:36.632 default/stage-0/default-step-0-0: new changesets 0feed1461a4a:b31d43a01132
24-Jan-2019 05:56:36 2019-01-24 00:56:36.632 default/stage-0/default-step-0-0: updating to branch default
24-Jan-2019 05:56:36 2019-01-24 00:56:36.632 default/stage-0/default-step-0-0: 95 files updated, 0 files merged, 0 files removed, 0 files unresolved
24-Jan-2019 05:56:36 2019-01-24 00:56:36.666 default/stage-0/default-step-0-0: + meson -Dprefix=/usr talkatu talkatu/build
24-Jan-2019 05:56:38 2019-01-24 00:56:38.585 default/stage-0/default-step-0-0: The Meson build system
24-Jan-2019 05:56:38 2019-01-24 00:56:38.585 default/stage-0/default-step-0-0: Version: 0.47.2
24-Jan-2019 05:56:38 2019-01-24 00:56:38.585 default/stage-0/default-step-0-0: Source dir: /workspace/talkatu
24-Jan-2019 05:56:38 2019-01-24 00:56:38.585 default/stage-0/default-step-0-0: Build dir: /workspace/talkatu/build
24-Jan-2019 05:56:38 2019-01-24 00:56:38.585 default/stage-0/default-step-0-0: Build type: native build
24-Jan-2019 05:56:38 2019-01-24 00:56:38.585 default/stage-0/default-step-0-0: Project name: talkatu
24-Jan-2019 05:56:38 2019-01-24 00:56:38.585 default/stage-0/default-step-0-0: Project version: 0.1.0-dev
24-Jan-2019 05:56:38 2019-01-24 00:56:38.585 default/stage-0/default-step-0-0: Native C compiler: cc (gcc 8.2.0 "cc (Debian 8.2.0-6) 8.2.0")
24-Jan-2019 05:56:38 2019-01-24 00:56:38.585 default/stage-0/default-step-0-0: Build machine cpu family: x86_64
24-Jan-2019 05:56:38 2019-01-24 00:56:38.585 default/stage-0/default-step-0-0: Build machine cpu: x86_64
24-Jan-2019 05:56:38 2019-01-24 00:56:38.585 default/stage-0/default-step-0-0: Found pkg-config: /usr/bin/pkg-config (0.29)
24-Jan-2019 05:56:38 2019-01-24 00:56:38.585 default/stage-0/default-step-0-0: Native dependency glib-2.0 found: YES 2.56.1
24-Jan-2019 05:56:38 2019-01-24 00:56:38.585 default/stage-0/default-step-0-0: Native dependency gobject-2.0 found: YES 2.56.1
24-Jan-2019 05:56:38 2019-01-24 00:56:38.585 default/stage-0/default-step-0-0: Native dependency gtk+-3.0 found: YES 3.22.30
24-Jan-2019 05:56:38 2019-01-24 00:56:38.585 default/stage-0/default-step-0-0: Native dependency gladeui-2.0 found: YES 3.22.1
24-Jan-2019 05:56:38 2019-01-24 00:56:38.585 default/stage-0/default-step-0-0: Native dependency gspell-1 found: YES 1.6.1
24-Jan-2019 05:56:38 2019-01-24 00:56:38.585 default/stage-0/default-step-0-0: Native dependency gumbo found: YES 0.10.1
24-Jan-2019 05:56:38 2019-01-24 00:56:38.585 default/stage-0/default-step-0-0: Native dependency libcmark found: YES 0.28.3
24-Jan-2019 05:56:38 2019-01-24 00:56:38.585 default/stage-0/default-step-0-0: Program help2man found: YES (/usr/bin/help2man)
24-Jan-2019 05:56:38 2019-01-24 00:56:38.585 default/stage-0/default-step-0-0: Program xvfb-run found: YES (/usr/bin/xvfb-run)
24-Jan-2019 05:56:38 2019-01-24 00:56:38.585 default/stage-0/default-step-0-0: Compiler for C supports arguments -Wformat: YES
24-Jan-2019 05:56:38 2019-01-24 00:56:38.585 default/stage-0/default-step-0-0: Compiler for C supports arguments -Wformat -Werror=format-security: YES
24-Jan-2019 05:56:38 2019-01-24 00:56:38.585 default/stage-0/default-step-0-0: Native dependency glib-2.0 found: YES 2.56.1
24-Jan-2019 05:56:38 2019-01-24 00:56:38.585 default/stage-0/default-step-0-0: Configuring talkatuversion.h using configuration
24-Jan-2019 05:56:38 2019-01-24 00:56:38.585 default/stage-0/default-step-0-0: Configuring talkatu.h using configuration
24-Jan-2019 05:56:38 2019-01-24 00:56:38.585 default/stage-0/default-step-0-0: Native dependency gobject-introspection-1.0 found: YES 1.56.1
24-Jan-2019 05:56:38 2019-01-24 00:56:38.585 default/stage-0/default-step-0-0: Program ./test-wrapper.py found: YES (/workspace/talkatu/talkatu/tests/./test-wrapper.py)
24-Jan-2019 05:56:38 2019-01-24 00:56:38.585 default/stage-0/default-step-0-0: Configuring version.xml using configuration
24-Jan-2019 05:56:38 2019-01-24 00:56:38.585 default/stage-0/default-step-0-0: Configuring talkatu.spec using configuration
24-Jan-2019 05:56:38 2019-01-24 00:56:38.585 default/stage-0/default-step-0-0: Build targets in project: 17
24-Jan-2019 05:56:38 2019-01-24 00:56:38.585 default/stage-0/default-step-0-0: Found ninja-1.8.2 at /usr/bin/ninja
24-Jan-2019 05:56:38 2019-01-24 00:56:38.628 default/stage-0/default-step-0-0: + ninja -C talkatu/build install
24-Jan-2019 05:56:38 2019-01-24 00:56:38.632 default/stage-0/default-step-0-0: ninja: Entering directory `talkatu/build'
24-Jan-2019 05:56:38 2019-01-24 00:56:38.646 default/stage-0/default-step-0-0: [1/42] Generating talkaturesources_h with a custom command.
24-Jan-2019 05:56:38 2019-01-24 00:56:38.649 default/stage-0/default-step-0-0: [2/42] Generating talkatudemoresources_h with a custom command.
24-Jan-2019 05:56:38 2019-01-24 00:56:38.652 default/stage-0/default-step-0-0: [3/42] Generating talkatudemoresources_c with a custom command.
24-Jan-2019 05:56:38 2019-01-24 00:56:38.655 default/stage-0/default-step-0-0: [4/42] Generating talkaturesources_c with a custom command.
24-Jan-2019 05:56:39 2019-01-24 00:56:39.040 default/stage-0/default-step-0-0: [5/42] Generating talkatuenums.h with a meson_exe.py custom command.
24-Jan-2019 05:56:39 2019-01-24 00:56:39.183 default/stage-0/default-step-0-0: [6/42] Compiling C object 'talkatu/talkatu@@talkatu@sha/talkatucodeset.c.o'.
24-Jan-2019 05:56:39 2019-01-24 00:56:39.207 default/stage-0/default-step-0-0: [7/42] Compiling C object 'talkatu/talkatu@@talkatu@sha/talkatucore.c.o'.
24-Jan-2019 05:56:39 2019-01-24 00:56:39.294 default/stage-0/default-step-0-0: [8/42] Compiling C object 'talkatu/talkatu@@talkatu@sha/meson-generated_.._talkaturesources.c.o'.
24-Jan-2019 05:56:39 2019-01-24 00:56:39.550 default/stage-0/default-step-0-0: [9/42] Compiling C object 'talkatu/talkatu@@talkatu@sha/talkatuhtmlbuffer.c.o'.
24-Jan-2019 05:56:39 2019-01-24 00:56:39.559 default/stage-0/default-step-0-0: [10/42] Compiling C object 'talkatu/talkatu@@talkatu@sha/talkatuhistory.c.o'.
24-Jan-2019 05:56:39 2019-01-24 00:56:39.566 default/stage-0/default-step-0-0: [11/42] Compiling C object 'talkatu/talkatu@@talkatu@sha/talkatulinkdialog.c.o'.
24-Jan-2019 05:56:39 2019-01-24 00:56:39.569 default/stage-0/default-step-0-0: [12/42] Compiling C object 'talkatu/talkatu@@talkatu@sha/talkatueditor.c.o'.
24-Jan-2019 05:56:39 2019-01-24 00:56:39.574 default/stage-0/default-step-0-0: [13/42] Compiling C object 'talkatu/talkatu@@talkatu@sha/talkatumarkdownbuffer.c.o'.
24-Jan-2019 05:56:39 2019-01-24 00:56:39.577 default/stage-0/default-step-0-0: [14/42] Compiling C object 'talkatu/talkatu@@talkatu@sha/talkatutag.c.o'.
24-Jan-2019 05:56:39 2019-01-24 00:56:39.578 default/stage-0/default-step-0-0: [15/42] Compiling C object 'talkatu/talkatu@@talkatu@sha/talkatumessage.c.o'.
24-Jan-2019 05:56:39 2019-01-24 00:56:39.579 default/stage-0/default-step-0-0: [16/42] Compiling C object 'talkatu/talkatu@@talkatu@sha/talkatumarkup.c.o'.
24-Jan-2019 05:56:39 2019-01-24 00:56:39.581 default/stage-0/default-step-0-0: [17/42] Compiling C object 'talkatu/talkatu@@talkatu@sha/talkatuhistorybuffer.c.o'.
24-Jan-2019 05:56:39 2019-01-24 00:56:39.610 default/stage-0/default-step-0-0: [18/42] Compiling C object 'talkatu/talkatu@@talkatu@sha/talkatubuffer.c.o'.
24-Jan-2019 05:56:39 2019-01-24 00:56:39.610 default/stage-0/default-step-0-0: [19/42] Compiling C object 'talkatu/talkatu@@talkatu@sha/talkatuactiongroup.c.o'.
24-Jan-2019 05:56:39 2019-01-24 00:56:39.611 default/stage-0/default-step-0-0: [20/42] Compiling C object 'talkatu/talkatu@@talkatu@sha/talkatumessageactions.c.o'.
24-Jan-2019 05:56:39 2019-01-24 00:56:39.659 default/stage-0/default-step-0-0: [21/42] Compiling C object 'talkatu/talkatu@@talkatu@sha/talkatumenutoolbutton.c.o'.
24-Jan-2019 05:56:39 2019-01-24 00:56:39.699 default/stage-0/default-step-0-0: [22/42] Compiling C object 'talkatu/talkatu@@talkatu@sha/talkatutagtable.c.o'.
24-Jan-2019 05:56:39 2019-01-24 00:56:39.769 default/stage-0/default-step-0-0: [23/42] Generating talkatuenums.c with a meson_exe.py custom command.
24-Jan-2019 05:56:39 2019-01-24 00:56:39.788 default/stage-0/default-step-0-0: [24/42] Compiling C object 'talkatu/talkatu@@talkatu@sha/talkatutooldrawer.c.o'.
24-Jan-2019 05:56:39 2019-01-24 00:56:39.802 default/stage-0/default-step-0-0: [25/42] Compiling C object 'demo/demo@@talkatu-demo@exe/meson-generated_.._talkatudemoresources.c.o'.
24-Jan-2019 05:56:39 2019-01-24 00:56:39.862 default/stage-0/default-step-0-0: [26/42] Compiling C object 'talkatu/talkatu@@talkatu@sha/talkatutoolbar.c.o'.
24-Jan-2019 05:56:39 2019-01-24 00:56:39.940 default/stage-0/default-step-0-0: [27/42] Compiling C object 'talkatu/talkatu@@talkatu@sha/talkatuview.c.o'.
24-Jan-2019 05:56:39 2019-01-24 00:56:39.940 default/stage-0/default-step-0-0: ../talkatu/talkatuview.c:208:1: warning: ?talkatu_view_copy_url_cb? defined but not used [-Wunused-function]
24-Jan-2019 05:56:39 2019-01-24 00:56:39.940 default/stage-0/default-step-0-0: talkatu_view_copy_url_cb(GtkMenuItem *item, gpointer data) {
24-Jan-2019 05:56:39 2019-01-24 00:56:39.940 default/stage-0/default-step-0-0: ^~~~~~~~~~~~~~~~~~~~~~~~
24-Jan-2019 05:56:39 2019-01-24 00:56:39.940 default/stage-0/default-step-0-0: ../talkatu/talkatuview.c:194:1: warning: ?talkatu_view_open_url_cb? defined but not used [-Wunused-function]
24-Jan-2019 05:56:39 2019-01-24 00:56:39.940 default/stage-0/default-step-0-0: talkatu_view_open_url_cb(GtkMenuItem *item, gpointer data) {
24-Jan-2019 05:56:39 2019-01-24 00:56:39.940 default/stage-0/default-step-0-0: ^~~~~~~~~~~~~~~~~~~~~~~~
24-Jan-2019 05:56:40 2019-01-24 00:56:40.038 default/stage-0/default-step-0-0: [28/42] Compiling C object 'talkatu/talkatu@@talkatu@sha/talkatuwholebuffer.c.o'.
24-Jan-2019 05:56:40 2019-01-24 00:56:40.050 default/stage-0/default-step-0-0: [29/42] Compiling C object 'talkatu/tests/talkatu@tests@@test-html-serialization@exe/talkatutesthtmlserialization.c.o'.
24-Jan-2019 05:56:40 2019-01-24 00:56:40.064 default/stage-0/default-step-0-0: [30/42] Compiling C object 'talkatu/tests/talkatu@tests@@test-action-group@exe/talkatutestactiongroup.c.o'.
24-Jan-2019 05:56:40 2019-01-24 00:56:40.079 default/stage-0/default-step-0-0: [31/42] Compiling C object 'demo/demo@@talkatu-demo@exe/talkatudemomessage.c.o'.
24-Jan-2019 05:56:40 2019-01-24 00:56:40.100 default/stage-0/default-step-0-0: [32/42] Compiling C object 'demo/demo@@talkatu-demo@exe/talkatudemo.c.o'.
24-Jan-2019 05:56:40 2019-01-24 00:56:40.238 default/stage-0/default-step-0-0: [33/42] Compiling C object 'talkatu/talkatu@@talkatu@sha/meson-generated_.._talkatuenums.c.o'.
24-Jan-2019 05:56:40 2019-01-24 00:56:40.385 default/stage-0/default-step-0-0: [34/42] Linking target talkatu/libtalkatu.so.0.1.0.
24-Jan-2019 05:56:40 2019-01-24 00:56:40.696 default/stage-0/default-step-0-0: [35/42] Generating symbol file 'talkatu/talkatu@@talkatu@sha/libtalkatu.so.0.1.0.symbols'.
24-Jan-2019 05:56:40 2019-01-24 00:56:40.901 default/stage-0/default-step-0-0: [36/42] Linking target demo/talkatu-demo.
24-Jan-2019 05:56:40 2019-01-24 00:56:40.938 default/stage-0/default-step-0-0: [37/42] Linking target talkatu/tests/test-action-group.
24-Jan-2019 05:56:40 2019-01-24 00:56:40.956 default/stage-0/default-step-0-0: [38/42] Linking target talkatu/tests/test-html-serialization.
24-Jan-2019 05:56:41 2019-01-24 00:56:41.021 default/stage-0/default-step-0-0: [39/42] Generating talkatu-demo.1 with a custom command.
24-Jan-2019 05:56:43 2019-01-24 00:56:43.931 default/stage-0/default-step-0-0: [40/42] Generating Talkatu-0.0.gir with a custom command.
24-Jan-2019 05:56:44 2019-01-24 00:56:44.733 default/stage-0/default-step-0-0: [41/42] Generating Talkatu-0.0.typelib with a custom command.
24-Jan-2019 05:56:44 2019-01-24 00:56:44.733 default/stage-0/default-step-0-0: [41/42] Installing files.
24-Jan-2019 05:56:50 2019-01-24 00:56:50.173 default/stage-0/default-step-0-0: Building documentation for talkatu
24-Jan-2019 05:56:50 2019-01-24 00:56:50.173 default/stage-0/default-step-0-0: ./talkatu-unused.txt:1: warning: 15 unused declarations. They should be added to talkatu-sections.txt in the appropriate place.
24-Jan-2019 05:56:50 2019-01-24 00:56:50.173 default/stage-0/default-step-0-0:
24-Jan-2019 05:56:50 2019-01-24 00:56:50.173 default/stage-0/default-step-0-0: html/TalkatuActionGroup.html:113: warning: no link for: "GtkTextBuffer" -> (<span class="type">GtkTextBuffer</span>).
24-Jan-2019 05:56:50 2019-01-24 00:56:50.173 default/stage-0/default-step-0-0: html/TalkatuActionGroup.html:130: warning: no link for: "G-SIGNAL-ACTION:CAPS" -> (Action).
24-Jan-2019 05:56:50 2019-01-24 00:56:50.173 default/stage-0/default-step-0-0: html/TalkatuActionGroup.html:186: warning: no link for: "GAction" -> (<span class="type">GAction</span>).
24-Jan-2019 05:56:50 2019-01-24 00:56:50.173 default/stage-0/default-step-0-0: html/TalkatuActionGroup.html:303: warning: no link for: "NULL:CAPS" -> (<code class="literal">NULL</code>).
24-Jan-2019 05:56:50 2019-01-24 00:56:50.173 default/stage-0/default-step-0-0: html/TalkatuBuffer.html:122: warning: no link for: "GActionGroup" -> (<span class="type">GActionGroup</span>).
24-Jan-2019 05:56:50 2019-01-24 00:56:50.173 default/stage-0/default-step-0-0: html/TalkatuBuffer.html:174: warning: no link for: "GSimpleActionGroup" -> (<span class="type">GSimpleActionGroup</span>).
24-Jan-2019 05:56:50 2019-01-24 00:56:50.173 default/stage-0/default-step-0-0: html/TalkatuBuffer.html:187: warning: no link for: "GSimpleAction" -> (<span class="type">GSimpleAction</span>).
24-Jan-2019 05:56:50 2019-01-24 00:56:50.173 default/stage-0/default-step-0-0: html/TalkatuBuffer.html:262: warning: no link for: "GtkTextIter" -> (<span class="type">GtkTextIter</span>).
24-Jan-2019 05:56:50 2019-01-24 00:56:50.173 default/stage-0/default-step-0-0: html/TalkatuBuffer.html:463: warning: no link for: "GtkTextTags" -> (<span class="type">GtkTextTags</span>).
24-Jan-2019 05:56:50 2019-01-24 00:56:50.173 default/stage-0/default-step-0-0: html/TalkatuMenuToolButton.html:81: warning: no link for: "GtkMenu" -> (<span class="type">GtkMenu</span>).
24-Jan-2019 05:56:50 2019-01-24 00:56:50.173 default/stage-0/default-step-0-0: html/TalkatuMenuToolButton.html:101: warning: no link for: "GtkMenuToolButton" -> (<span class="type">GtkMenuToolButton</span>).
24-Jan-2019 05:56:50 2019-01-24 00:56:50.173 default/stage-0/default-step-0-0: html/TalkatuMenuToolButton.html:102: warning: no link for: "GtkToolItem" -> (<span class="type">GtkToolItem</span>).
24-Jan-2019 05:56:50 2019-01-24 00:56:50.173 default/stage-0/default-step-0-0: html/TalkatuMenuToolButton.html:111: warning: no link for: "GtkWidget" -> (<span class="type">GtkWidget</span>).
24-Jan-2019 05:56:50 2019-01-24 00:56:50.173 default/stage-0/default-step-0-0: html/TalkatuMessageActions.html:73: warning: no link for: "GObject" -> (<span class="type">GObject</span>).
24-Jan-2019 05:56:50 2019-01-24 00:56:50.173 default/stage-0/default-step-0-0: html/TalkatuToolDrawer.html:159: warning: no link for: "GtkToolItems" -> (<span class="type">GtkToolItems</span>).
24-Jan-2019 05:56:50 2019-01-24 00:56:50.173 default/stage-0/default-step-0-0: html/TalkatuToolDrawer.html:208: warning: no link for: "GCallback" -> (<span class="type">GCallback</span>).
24-Jan-2019 05:56:50 2019-01-24 00:56:50.173 default/stage-0/default-step-0-0: html/TalkatuToolDrawer.html:421: warning: no link for: "TRUE:CAPS" -> (<code class="literal">TRUE</code>).
24-Jan-2019 05:56:50 2019-01-24 00:56:50.173 default/stage-0/default-step-0-0: html/TalkatuToolDrawer.html:422: warning: no link for: "FALSE:CAPS" -> (<code class="literal">FALSE</code>).
24-Jan-2019 05:56:50 2019-01-24 00:56:50.173 default/stage-0/default-step-0-0: html/talkatu-Codeset-Helpers.html:64: warning: no link for: "GError" -> (<span class="type">GError</span>).
24-Jan-2019 05:56:50 2019-01-24 00:56:50.173 default/stage-0/default-step-0-0: html/talkatu-Markup-Helpers.html:119: warning: no link for: "GtkTextBufferDeserializeFunc" -> (<span class="type">GtkTextBufferDeserializeFunc</span>).
24-Jan-2019 05:56:50 2019-01-24 00:56:50.173 default/stage-0/default-step-0-0: html/talkatu-Markup-Helpers.html:319: warning: no link for: "GtkTextBufferSerializeFunc" -> (<span class="type">GtkTextBufferSerializeFunc</span>).
24-Jan-2019 05:56:50 2019-01-24 00:56:50.173 default/stage-0/default-step-0-0:
24-Jan-2019 05:56:50 2019-01-24 00:56:50.500 default/stage-0/default-step-0-0: Installing talkatu/talkatuenums.h to /usr/include/talkatu-1.0/talkatu
24-Jan-2019 05:56:50 2019-01-24 00:56:50.500 default/stage-0/default-step-0-0: Installing talkatu/libtalkatu.so.0.1.0 to /usr/lib/x86_64-linux-gnu
24-Jan-2019 05:56:50 2019-01-24 00:56:50.500 default/stage-0/default-step-0-0: Installing talkatu/Talkatu-0.0.gir to /usr/share/gir-1.0
24-Jan-2019 05:56:50 2019-01-24 00:56:50.500 default/stage-0/default-step-0-0: Installing talkatu/Talkatu-0.0.typelib to /usr/lib/x86_64-linux-gnu/girepository-1.0
24-Jan-2019 05:56:50 2019-01-24 00:56:50.500 default/stage-0/default-step-0-0: Installing demo/talkatu-demo to /usr/bin
24-Jan-2019 05:56:50 2019-01-24 00:56:50.500 default/stage-0/default-step-0-0: Installing demo/talkatu-demo.1 to /usr/share/man/man1
24-Jan-2019 05:56:50 2019-01-24 00:56:50.500 default/stage-0/default-step-0-0: Installing /workspace/talkatu/talkatu/talkatuactiongroup.h to /usr/include/talkatu-1.0/talkatu
24-Jan-2019 05:56:50 2019-01-24 00:56:50.500 default/stage-0/default-step-0-0: Installing /workspace/talkatu/talkatu/talkatubuffer.h to /usr/include/talkatu-1.0/talkatu
24-Jan-2019 05:56:50 2019-01-24 00:56:50.500 default/stage-0/default-step-0-0: Installing /workspace/talkatu/talkatu/talkatucodeset.h to /usr/include/talkatu-1.0/talkatu
24-Jan-2019 05:56:50 2019-01-24 00:56:50.500 default/stage-0/default-step-0-0: Installing /workspace/talkatu/talkatu/talkatucore.h to /usr/include/talkatu-1.0/talkatu
24-Jan-2019 05:56:50 2019-01-24 00:56:50.500 default/stage-0/default-step-0-0: Installing /workspace/talkatu/talkatu/talkatueditor.h to /usr/include/talkatu-1.0/talkatu
24-Jan-2019 05:56:50 2019-01-24 00:56:50.500 default/stage-0/default-step-0-0: Installing /workspace/talkatu/talkatu/talkatuhistory.h to /usr/include/talkatu-1.0/talkatu
24-Jan-2019 05:56:50 2019-01-24 00:56:50.500 default/stage-0/default-step-0-0: Installing /workspace/talkatu/talkatu/talkatuhistorybuffer.h to /usr/include/talkatu-1.0/talkatu
24-Jan-2019 05:56:50 2019-01-24 00:56:50.500 default/stage-0/default-step-0-0: Installing /workspace/talkatu/talkatu/talkatuhtmlbuffer.h to /usr/include/talkatu-1.0/talkatu
24-Jan-2019 05:56:50 2019-01-24 00:56:50.500 default/stage-0/default-step-0-0: Installing /workspace/talkatu/talkatu/talkatulinkdialog.h to /usr/include/talkatu-1.0/talkatu
24-Jan-2019 05:56:50 2019-01-24 00:56:50.500 default/stage-0/default-step-0-0: Installing /workspace/talkatu/talkatu/talkatumarkdownbuffer.h to /usr/include/talkatu-1.0/talkatu
24-Jan-2019 05:56:50 2019-01-24 00:56:50.500 default/stage-0/default-step-0-0: Installing /workspace/talkatu/talkatu/talkatumarkup.h to /usr/include/talkatu-1.0/talkatu
24-Jan-2019 05:56:50 2019-01-24 00:56:50.500 default/stage-0/default-step-0-0: Installing /workspace/talkatu/talkatu/talkatumenutoolbutton.h to /usr/include/talkatu-1.0/talkatu
24-Jan-2019 05:56:50 2019-01-24 00:56:50.500 default/stage-0/default-step-0-0: Installing /workspace/talkatu/talkatu/talkatumessage.h to /usr/include/talkatu-1.0/talkatu
24-Jan-2019 05:56:50 2019-01-24 00:56:50.500 default/stage-0/default-step-0-0: Installing /workspace/talkatu/talkatu/talkatumessageactions.h to /usr/include/talkatu-1.0/talkatu
24-Jan-2019 05:56:50 2019-01-24 00:56:50.500 default/stage-0/default-step-0-0: Installing /workspace/talkatu/talkatu/talkatutag.h to /usr/include/talkatu-1.0/talkatu
24-Jan-2019 05:56:50 2019-01-24 00:56:50.500 default/stage-0/default-step-0-0: Installing /workspace/talkatu/talkatu/talkatutagtable.h to /usr/include/talkatu-1.0/talkatu
24-Jan-2019 05:56:50 2019-01-24 00:56:50.500 default/stage-0/default-step-0-0: Installing /workspace/talkatu/talkatu/talkatutoolbar.h to /usr/include/talkatu-1.0/talkatu
24-Jan-2019 05:56:50 2019-01-24 00:56:50.500 default/stage-0/default-step-0-0: Installing /workspace/talkatu/talkatu/talkatutooldrawer.h to /usr/include/talkatu-1.0/talkatu
24-Jan-2019 05:56:50 2019-01-24 00:56:50.500 default/stage-0/default-step-0-0: Installing /workspace/talkatu/talkatu/talkatuview.h to /usr/include/talkatu-1.0/talkatu
24-Jan-2019 05:56:50 2019-01-24 00:56:50.500 default/stage-0/default-step-0-0: Installing /workspace/talkatu/talkatu/talkatuwholebuffer.h to /usr/include/talkatu-1.0/talkatu
24-Jan-2019 05:56:50 2019-01-24 00:56:50.500 default/stage-0/default-step-0-0: Installing /workspace/talkatu/build/talkatu/talkatuversion.h to /usr/include/talkatu-1.0/talkatu
24-Jan-2019 05:56:50 2019-01-24 00:56:50.500 default/stage-0/default-step-0-0: Installing /workspace/talkatu/build/talkatu/talkatu.h to /usr/include/talkatu-1.0
24-Jan-2019 05:56:50 2019-01-24 00:56:50.500 default/stage-0/default-step-0-0: Installing /workspace/talkatu/build/meson-private/talkatu.pc to /usr/lib/x86_64-linux-gnu/pkgconfig
24-Jan-2019 05:56:50 2019-01-24 00:56:50.500 default/stage-0/default-step-0-0: Installing /workspace/talkatu/talkatu/talkatu.xml to /usr/share/glade/catalogs
24-Jan-2019 05:56:50 2019-01-24 00:56:50.500 default/stage-0/default-step-0-0: Installing /workspace/talkatu/ChangeLog to /usr/share/doc/talkatu
24-Jan-2019 05:56:50 2019-01-24 00:56:50.500 default/stage-0/default-step-0-0: Installing /workspace/talkatu/INSTALL to /usr/share/doc/talkatu
24-Jan-2019 05:56:50 2019-01-24 00:56:50.500 default/stage-0/default-step-0-0: Installing /workspace/talkatu/README.md to /usr/share/doc/talkatu
24-Jan-2019 05:56:50 2019-01-24 00:56:50.500 default/stage-0/default-step-0-0: Installing /workspace/talkatu/HACKING to /usr/share/doc/talkatu
24-Jan-2019 05:56:50 2019-01-24 00:56:50.500 default/stage-0/default-step-0-0: Installing /workspace/talkatu/logo.png to /usr/share/doc/talkatu
24-Jan-2019 05:56:50 2019-01-24 00:56:50.500 default/stage-0/default-step-0-0: Running custom install script '/usr/bin/python3 /usr/bin/meson --internal gtkdoc --sourcedir=/workspace/talkatu --builddir=/workspace/talkatu/build --subdir=talkatu/reference --headerdirs=/workspace/talkatu/talkatu/.@@/workspace/talkatu/build/talkatu/. --mainfile=talkatu-docs.xml --modulename=talkatu --mode=auto --scanargs=--rebuild-types@@--rebuild-sections@@--ignore-headers=talkatu.h talkatuenums.h talkaturesources.h --gobjects-types-file=/workspace/talkatu/talkatu/reference/talkatu.types --mkdbargs=--ignore-files=talkatu.h talkatuenums.h talkaturesources.h --content-files= --cflags=-I/workspace/talkatu/build/. -I/workspace/talkatu/. -I/workspace/talkatu/build/talkatu/. -I/workspace/talkatu/talkatu/. -I/usr/include/glib-2.0 -I/usr/lib/x86_64-linux-gnu/glib-2.0/include -pthread -I/usr/include/gtk-3.0 -I/usr/include/at-spi2-atk/2.0 -I/usr/include/at-spi-2.0 -I/usr/include/dbus-1.0 -I/usr/lib/x86_64-linux-gnu/dbus-1.0/include -I/usr/include/gio-unix-2.0/ -I/usr/include/cairo -I/usr/include/pango-1.0 -I/usr/include/harfbuzz -I/usr/include/fribidi -I/usr/include/atk-1.0 -I/usr/include/pixman-1 -I/usr/include/uuid -I/usr/include/freetype2 -I/usr/include/libpng16 -I/usr/include/gdk-pixbuf-2.0 -I/usr/include/gspell-1 -I/usr/include/enchant --ldflags=-L/workspace/talkatu/build/talkatu -Wl,-rpath,/workspace/talkatu/build/talkatu -ltalkatu -lcmark -lglib-2.0 -lgobject-2.0 -lgumbo -lgtk-3 -lgdk-3 -lpangocairo-1.0 -lpango-1.0 -latk-1.0 -lcairo-gobject -lcairo -lgdk_pixbuf-2.0 -lgio-2.0 -lgspell-1 -lenchant --cc=cc --ld=cc'
24-Jan-2019 05:56:50 2019-01-24 00:56:50.500 default/stage-0/default-step-0-0: Running custom install script '/usr/bin/python3 /usr/bin/meson --internal gettext install --subdir=po --localedir=share/locale --pkgname=talkatu'
24-Jan-2019 05:56:50 2019-01-24 00:56:50.547 default/stage-0/default-step-0-0: + hg clone https://bitbucket.org/pidgin/libgnt
24-Jan-2019 05:56:52 2019-01-24 00:56:52.163 default/stage-0/default-step-0-0: destination directory: libgnt
24-Jan-2019 05:56:52 2019-01-24 00:56:52.163 default/stage-0/default-step-0-0: requesting all changes
24-Jan-2019 05:56:52 2019-01-24 00:56:52.163 default/stage-0/default-step-0-0: adding changesets
24-Jan-2019 05:56:52 2019-01-24 00:56:52.163 default/stage-0/default-step-0-0: adding manifests
24-Jan-2019 05:56:52 2019-01-24 00:56:52.163 default/stage-0/default-step-0-0: adding file changes
24-Jan-2019 05:56:52 2019-01-24 00:56:52.163 default/stage-0/default-step-0-0: added 1081 changesets with 2862 changes to 117 files (+1 heads)
24-Jan-2019 05:56:52 2019-01-24 00:56:52.300 default/stage-0/default-step-0-0: new changesets 1e560a4fa6ac:3cb435985468
24-Jan-2019 05:56:52 2019-01-24 00:56:52.300 default/stage-0/default-step-0-0: updating to branch default
24-Jan-2019 05:56:52 2019-01-24 00:56:52.300 default/stage-0/default-step-0-0: 81 files updated, 0 files merged, 0 files removed, 0 files unresolved
24-Jan-2019 05:56:52 2019-01-24 00:56:52.334 default/stage-0/default-step-0-0: + meson -Dprefix=/usr libgnt libgnt/build
24-Jan-2019 05:56:53 2019-01-24 00:56:53.934 default/stage-0/default-step-0-0: The Meson build system
24-Jan-2019 05:56:53 2019-01-24 00:56:53.934 default/stage-0/default-step-0-0: Version: 0.47.2
24-Jan-2019 05:56:53 2019-01-24 00:56:53.934 default/stage-0/default-step-0-0: Source dir: /workspace/libgnt
24-Jan-2019 05:56:53 2019-01-24 00:56:53.934 default/stage-0/default-step-0-0: Build dir: /workspace/libgnt/build
24-Jan-2019 05:56:53 2019-01-24 00:56:53.934 default/stage-0/default-step-0-0: Build type: native build
24-Jan-2019 05:56:53 2019-01-24 00:56:53.934 default/stage-0/default-step-0-0: Project name: libgnt
24-Jan-2019 05:56:53 2019-01-24 00:56:53.934 default/stage-0/default-step-0-0: Project version: 2.9.0-devel
24-Jan-2019 05:56:53 2019-01-24 00:56:53.934 default/stage-0/default-step-0-0: Native C compiler: cc (gcc 8.2.0 "cc (Debian 8.2.0-6) 8.2.0")
24-Jan-2019 05:56:53 2019-01-24 00:56:53.934 default/stage-0/default-step-0-0: Build machine cpu family: x86_64
24-Jan-2019 05:56:53 2019-01-24 00:56:53.934 default/stage-0/default-step-0-0: Build machine cpu: x86_64
24-Jan-2019 05:56:53 2019-01-24 00:56:53.934 default/stage-0/default-step-0-0: Found pkg-config: /usr/bin/pkg-config (0.29)
24-Jan-2019 05:56:53 2019-01-24 00:56:53.934 default/stage-0/default-step-0-0: Native dependency glib-2.0 found: YES 2.56.1
24-Jan-2019 05:56:53 2019-01-24 00:56:53.934 default/stage-0/default-step-0-0: Native dependency gobject-2.0 found: YES 2.56.1
24-Jan-2019 05:56:53 2019-01-24 00:56:53.934 default/stage-0/default-step-0-0: Native dependency libxml-2.0 found: YES 2.9.4
24-Jan-2019 05:56:53 2019-01-24 00:56:53.934 default/stage-0/default-step-0-0: Native dependency ncursesw found: YES 6.1.20180714
24-Jan-2019 05:56:53 2019-01-24 00:56:53.934 default/stage-0/default-step-0-0: Native dependency panelw found: YES 6.1.20180714
24-Jan-2019 05:56:53 2019-01-24 00:56:53.934 default/stage-0/default-step-0-0: Header <ncurses.h> has symbol "get_wch": YES
24-Jan-2019 05:56:53 2019-01-24 00:56:53.934 default/stage-0/default-step-0-0: Header <ncursesw/ncurses.h> has symbol "get_wch": YES
24-Jan-2019 05:56:53 2019-01-24 00:56:53.934 default/stage-0/default-step-0-0: Native dependency python3 found: YES 3.6
24-Jan-2019 05:56:53 2019-01-24 00:56:53.934 default/stage-0/default-step-0-0: Configuring gntconfig.h using configuration
24-Jan-2019 05:56:53 2019-01-24 00:56:53.934 default/stage-0/default-step-0-0: Configuring gntversion.h using configuration
24-Jan-2019 05:56:53 2019-01-24 00:56:53.934 default/stage-0/default-step-0-0: Configuring gnt.h using configuration
24-Jan-2019 05:56:53 2019-01-24 00:56:53.934 default/stage-0/default-step-0-0: Native dependency gmodule-2.0 found: YES 2.56.1
24-Jan-2019 05:56:53 2019-01-24 00:56:53.934 default/stage-0/default-step-0-0: WARNING: Project targetting '>=0.37.0' but tried to use feature introduced in '0.41.0': variables arg in pkgconfig.generate
24-Jan-2019 05:56:53 2019-01-24 00:56:53.934 default/stage-0/default-step-0-0: WARNING: Project targetting '>=0.37.0' but tried to use feature introduced in '0.41.0': custom pkgconfig variables
24-Jan-2019 05:56:53 2019-01-24 00:56:53.934 default/stage-0/default-step-0-0: Native dependency gobject-introspection-1.0 found: YES 1.56.1
24-Jan-2019 05:56:53 2019-01-24 00:56:53.934 default/stage-0/default-step-0-0: WARNING: Project targetting '>=0.37.0' but tried to use feature introduced in '0.40.0': build_by_default arg in build target
24-Jan-2019 05:56:53 2019-01-24 00:56:53.934 default/stage-0/default-step-0-0: Configuring version.xml using configuration
24-Jan-2019 05:56:53 2019-01-24 00:56:53.934 default/stage-0/default-step-0-0: Build targets in project: 14
24-Jan-2019 05:56:53 2019-01-24 00:56:53.934 default/stage-0/default-step-0-0: WARNING: Project specifies a minimum meson_version '>=0.37.0' but uses features which were added in newer versions:
24-Jan-2019 05:56:53 2019-01-24 00:56:53.934 default/stage-0/default-step-0-0: * 0.40.0: {'build_by_default arg in build target'}
24-Jan-2019 05:56:53 2019-01-24 00:56:53.934 default/stage-0/default-step-0-0: * 0.41.0: {'variables arg in pkgconfig.generate', 'custom pkgconfig variables'}
24-Jan-2019 05:56:53 2019-01-24 00:56:53.934 default/stage-0/default-step-0-0: Found ninja-1.8.2 at /usr/bin/ninja
24-Jan-2019 05:56:53 2019-01-24 00:56:53.989 default/stage-0/default-step-0-0: + ninja -C libgnt/build install
24-Jan-2019 05:56:53 2019-01-24 00:56:53.993 default/stage-0/default-step-0-0: ninja: Entering directory `libgnt/build'
24-Jan-2019 05:56:54 2019-01-24 00:56:54.148 default/stage-0/default-step-0-0: [1/35] Compiling C object 'gnt@sha/gntclipboard.c.o'.
24-Jan-2019 05:56:54 2019-01-24 00:56:54.182 default/stage-0/default-step-0-0: [2/35] Compiling C object 'gnt@sha/gntline.c.o'.
24-Jan-2019 05:56:54 2019-01-24 00:56:54.186 default/stage-0/default-step-0-0: [3/35] Compiling C object 'gnt@sha/gntmenuitem.c.o'.
24-Jan-2019 05:56:54 2019-01-24 00:56:54.201 default/stage-0/default-step-0-0: [4/35] Compiling C object 'gnt@sha/gntbutton.c.o'.
24-Jan-2019 05:56:54 2019-01-24 00:56:54.214 default/stage-0/default-step-0-0: [5/35] Compiling C object 'gnt@sha/gntprogressbar.c.o'.
24-Jan-2019 05:56:54 2019-01-24 00:56:54.218 default/stage-0/default-step-0-0: [6/35] Compiling C object 'gnt@sha/gntcolors.c.o'.
24-Jan-2019 05:56:54 2019-01-24 00:56:54.227 default/stage-0/default-step-0-0: [7/35] Compiling C object 'gnt@sha/gntslider.c.o'.
24-Jan-2019 05:56:54 2019-01-24 00:56:54.247 default/stage-0/default-step-0-0: [8/35] Compiling C object 'gnt@sha/gntcombobox.c.o'.
24-Jan-2019 05:56:54 2019-01-24 00:56:54.249 default/stage-0/default-step-0-0: [9/35] Compiling C object 'gnt@sha/gntwidget.c.o'.
24-Jan-2019 05:56:54 2019-01-24 00:56:54.253 default/stage-0/default-step-0-0: [10/35] Compiling C object 'gnt@sha/gntkeys.c.o'.
24-Jan-2019 05:56:54 2019-01-24 00:56:54.259 default/stage-0/default-step-0-0: [11/35] Compiling C object 'gnt@sha/gntmenuitemcheck.c.o'.
24-Jan-2019 05:56:54 2019-01-24 00:56:54.263 default/stage-0/default-step-0-0: [12/35] Compiling C object 'gnt@sha/gntmenu.c.o'.
24-Jan-2019 05:56:54 2019-01-24 00:56:54.269 default/stage-0/default-step-0-0: [13/35] Compiling C object 'gnt@sha/gntlabel.c.o'.
24-Jan-2019 05:56:54 2019-01-24 00:56:54.293 default/stage-0/default-step-0-0: [14/35] Compiling C object 'gnt@sha/gntbox.c.o'.
24-Jan-2019 05:56:54 2019-01-24 00:56:54.294 default/stage-0/default-step-0-0: [15/35] Compiling C object 'gnt@sha/gntbindable.c.o'.
24-Jan-2019 05:56:54 2019-01-24 00:56:54.305 default/stage-0/default-step-0-0: [16/35] Compiling C object 'gnt@sha/gntcheckbox.c.o'.
24-Jan-2019 05:56:54 2019-01-24 00:56:54.344 default/stage-0/default-step-0-0: [17/35] Compiling C object 'gnt@sha/gntentry.c.o'.
24-Jan-2019 05:56:54 2019-01-24 00:56:54.361 default/stage-0/default-step-0-0: [18/35] Compiling C object 'gnt@sha/gntfilesel.c.o'.
24-Jan-2019 05:56:54 2019-01-24 00:56:54.397 default/stage-0/default-step-0-0: [19/35] Compiling C object 'gnt@sha/gntstyle.c.o'.
24-Jan-2019 05:56:54 2019-01-24 00:56:54.408 default/stage-0/default-step-0-0: [20/35] Compiling C object 'gnt@sha/gntwindow.c.o'.
24-Jan-2019 05:56:54 2019-01-24 00:56:54.436 default/stage-0/default-step-0-0: [21/35] Compiling C object 'gnt@sha/gntws.c.o'.
24-Jan-2019 05:56:54 2019-01-24 00:56:54.456 default/stage-0/default-step-0-0: [22/35] Compiling C object 'wms/wms@@s@sha/s.c.o'.
24-Jan-2019 05:56:54 2019-01-24 00:56:54.468 default/stage-0/default-step-0-0: [23/35] Compiling C object 'wms/wms@@irssi@sha/irssi.c.o'.
24-Jan-2019 05:56:54 2019-01-24 00:56:54.468 default/stage-0/default-step-0-0: [24/35] Compiling C object 'gnt@sha/gnttextview.c.o'.
24-Jan-2019 05:56:54 2019-01-24 00:56:54.482 default/stage-0/default-step-0-0: [25/35] Compiling C object 'gnt@sha/gntutils.c.o'.
24-Jan-2019 05:56:54 2019-01-24 00:56:54.502 default/stage-0/default-step-0-0: [26/35] Compiling C object 'gnt@sha/gntmain.c.o'.
24-Jan-2019 05:56:54 2019-01-24 00:56:54.617 default/stage-0/default-step-0-0: [27/35] Compiling C object 'gnt@sha/gnttree.c.o'.
24-Jan-2019 05:56:54 2019-01-24 00:56:54.743 default/stage-0/default-step-0-0: [28/35] Compiling C object 'gnt@sha/gntwm.c.o'.
24-Jan-2019 05:56:54 2019-01-24 00:56:54.881 default/stage-0/default-step-0-0: [29/35] Linking target libgnt.so.1.9.0.
24-Jan-2019 05:56:55 2019-01-24 00:56:55.196 default/stage-0/default-step-0-0: [30/35] Generating symbol file 'gnt@sha/libgnt.so.1.9.0.symbols'.
24-Jan-2019 05:56:55 2019-01-24 00:56:55.259 default/stage-0/default-step-0-0: [31/35] Linking target wms/s.so.
24-Jan-2019 05:56:55 2019-01-24 00:56:55.261 default/stage-0/default-step-0-0: [32/35] Linking target wms/irssi.so.
24-Jan-2019 05:56:56 2019-01-24 00:56:56.672 default/stage-0/default-step-0-0: [33/35] Generating Gnt-2.9.gir with a custom command.
24-Jan-2019 05:56:56 2019-01-24 00:56:56.672 default/stage-0/default-step-0-0: /workspace/libgnt/gntwidget.h:106: syntax error, unexpected identifier in ' WINDOW *window;' at 'WINDOW'
24-Jan-2019 05:56:56 2019-01-24 00:56:56.672 default/stage-0/default-step-0-0: /workspace/libgnt/gntwidget.h:113: syntax error, unexpected '}' in '};' at '}'
24-Jan-2019 05:56:56 2019-01-24 00:56:56.672 default/stage-0/default-step-0-0: gnttextview.h:154: Warning: Gnt: gnt_text_format_flag_to_chtype: return value: Unresolved type: 'chtype'
24-Jan-2019 05:56:56 2019-01-24 00:56:56.890 default/stage-0/default-step-0-0: [34/35] Generating Gnt-2.9.typelib with a custom command.
24-Jan-2019 05:56:56 2019-01-24 00:56:56.890 default/stage-0/default-step-0-0: [34/35] Installing files.
24-Jan-2019 05:57:08 2019-01-24 00:57:08.185 default/stage-0/default-step-0-0: Building documentation for libgnt
24-Jan-2019 05:57:08 2019-01-24 00:57:08.185 default/stage-0/default-step-0-0: /workspace/libgnt/build/./gnt.h:97: warning: Parameter description for gnt_screen_occupy::widget is missing in source code comment block.
24-Jan-2019 05:57:08 2019-01-24 00:57:08.185 default/stage-0/default-step-0-0: /workspace/libgnt/build/./gnt.h:105: warning: Parameter description for gnt_screen_release::widget is missing in source code comment block.
24-Jan-2019 05:57:08 2019-01-24 00:57:08.185 default/stage-0/default-step-0-0: /workspace/libgnt/build/./gnt.h:113: warning: Parameter description for gnt_screen_update::widget is missing in source code comment block.
24-Jan-2019 05:57:08 2019-01-24 00:57:08.185 default/stage-0/default-step-0-0: unknown:0: warning: Field descriptions for struct GntBindableAction are missing in source code comment block.
24-Jan-2019 05:57:08 2019-01-24 00:57:08.185 default/stage-0/default-step-0-0: unknown:0: warning: Field descriptions for struct GntBindableActionParam are missing in source code comment block.
24-Jan-2019 05:57:08 2019-01-24 00:57:08.185 default/stage-0/default-step-0-0: /workspace/libgnt/./gntbindable.h:129: warning: Parameter description for gnt_bindable_class_register_action::... is missing in source code comment block.
24-Jan-2019 05:57:08 2019-01-24 00:57:08.185 default/stage-0/default-step-0-0: /workspace/libgnt/./gntbindable.h:139: warning: Parameter description for gnt_bindable_register_binding::... is missing in source code comment block.
24-Jan-2019 05:57:08 2019-01-24 00:57:08.185 default/stage-0/default-step-0-0: /workspace/libgnt/./gntbindable.h:172: warning: Parameter description for gnt_bindable_perform_action_named::... is missing in source code comment block.
24-Jan-2019 05:57:08 2019-01-24 00:57:08.185 default/stage-0/default-step-0-0: unknown:0: warning: Value descriptions for GntAlignment are missing in source code comment block.
24-Jan-2019 05:57:08 2019-01-24 00:57:08.185 default/stage-0/default-step-0-0: unknown:0: warning: Field descriptions for struct GntButtonPriv are missing in source code comment block.
24-Jan-2019 05:57:08 2019-01-24 00:57:08.185 default/stage-0/default-step-0-0: /workspace/libgnt/./gntcolors.h:38: warning: Value descriptions for GntColorType are missing in source code comment block.
24-Jan-2019 05:57:08 2019-01-24 00:57:08.185 default/stage-0/default-step-0-0: unknown:0: warning: Value descriptions for GntEntryFlag are missing in source code comment block.
24-Jan-2019 05:57:08 2019-01-24 00:57:08.185 default/stage-0/default-step-0-0: unknown:0: warning: Value descriptions for GntFileType are missing in source code comment block.
24-Jan-2019 05:57:08 2019-01-24 00:57:08.185 default/stage-0/default-step-0-0: unknown:0: warning: Field descriptions for struct GntMenuItemPriv are missing in source code comment block.
24-Jan-2019 05:57:08 2019-01-24 00:57:08.185 default/stage-0/default-step-0-0: unknown:0: warning: Value descriptions for GntProgressBarOrientation are missing in source code comment block.
24-Jan-2019 05:57:08 2019-01-24 00:57:08.185 default/stage-0/default-step-0-0: unknown:0: warning: Value descriptions for GntStyle are missing in source code comment block.
24-Jan-2019 05:57:08 2019-01-24 00:57:08.185 default/stage-0/default-step-0-0: /workspace/libgnt/./gntstyle.h:136: warning: Parameter description for gnt_styles_get_keyremaps::type is missing in source code comment block.
24-Jan-2019 05:57:08 2019-01-24 00:57:08.185 default/stage-0/default-step-0-0: /workspace/libgnt/./gntstyle.h:136: warning: Parameter description for gnt_styles_get_keyremaps::hash is missing in source code comment block.
24-Jan-2019 05:57:08 2019-01-24 00:57:08.185 default/stage-0/default-step-0-0: /workspace/libgnt/./gntstyle.h:143: warning: Parameter description for gnt_style_read_actions::type is missing in source code comment block.
24-Jan-2019 05:57:08 2019-01-24 00:57:08.185 default/stage-0/default-step-0-0: /workspace/libgnt/./gntstyle.h:143: warning: Parameter description for gnt_style_read_actions::klass is missing in source code comment block.
24-Jan-2019 05:57:08 2019-01-24 00:57:08.185 default/stage-0/default-step-0-0: /workspace/libgnt/./gntstyle.h:163: warning: Parameter description for gnt_style_read_workspaces::wm is missing in source code comment block.
24-Jan-2019 05:57:08 2019-01-24 00:57:08.185 default/stage-0/default-step-0-0: unknown:0: warning: Value descriptions for GntTextViewFlag are missing in source code comment block.
24-Jan-2019 05:57:08 2019-01-24 00:57:08.185 default/stage-0/default-step-0-0: unknown:0: warning: Value descriptions for GntTextFormatFlags are missing in source code comment block.
24-Jan-2019 05:57:08 2019-01-24 00:57:08.185 default/stage-0/default-step-0-0: unknown:0: warning: Value descriptions for GntTreeColumnFlag are missing in source code comment block.
24-Jan-2019 05:57:08 2019-01-24 00:57:08.185 default/stage-0/default-step-0-0: unknown:0: warning: Field descriptions for struct GntTreeColInfo are missing in source code comment block.
24-Jan-2019 05:57:08 2019-01-24 00:57:08.185 default/stage-0/default-step-0-0: /workspace/libgnt/./gntutils.h:110: warning: Parameter description for gnt_boolean_handled_accumulator::ihint is missing in source code comment block.
24-Jan-2019 05:57:08 2019-01-24 00:57:08.185 default/stage-0/default-step-0-0: /workspace/libgnt/./gntutils.h:110: warning: Parameter description for gnt_boolean_handled_accumulator::return_accu is missing in source code comment block.
24-Jan-2019 05:57:08 2019-01-24 00:57:08.185 default/stage-0/default-step-0-0: /workspace/libgnt/./gntutils.h:110: warning: Parameter description for gnt_boolean_handled_accumulator::handler_return is missing in source code comment block.
24-Jan-2019 05:57:08 2019-01-24 00:57:08.185 default/stage-0/default-step-0-0: /workspace/libgnt/./gntutils.h:110: warning: Parameter description for gnt_boolean_handled_accumulator::dummy is missing in source code comment block.
24-Jan-2019 05:57:08 2019-01-24 00:57:08.185 default/stage-0/default-step-0-0: /workspace/libgnt/./gntutils.h:140: warning: Parameter description for gnt_util_parse_widgets::... is missing in source code comment block.
24-Jan-2019 05:57:08 2019-01-24 00:57:08.185 default/stage-0/default-step-0-0: unknown:0: warning: Value descriptions for GntWidgetFlags are missing in source code comment block.
24-Jan-2019 05:57:08 2019-01-24 00:57:08.185 default/stage-0/default-step-0-0: unknown:0: warning: Value descriptions for GntMouseEvent are missing in source code comment block.
24-Jan-2019 05:57:08 2019-01-24 00:57:08.185 default/stage-0/default-step-0-0: unknown:0: warning: Value descriptions for GntParamFlags are missing in source code comment block.
24-Jan-2019 05:57:08 2019-01-24 00:57:08.185 default/stage-0/default-step-0-0: unknown:0: warning: Field descriptions for struct GntWidgetPriv are missing in source code comment block.
24-Jan-2019 05:57:08 2019-01-24 00:57:08.185 default/stage-0/default-step-0-0: /workspace/libgnt/./gntwidget.h:186: warning: Parameter description for gnt_widget_expose::widget is missing in source code comment block.
24-Jan-2019 05:57:08 2019-01-24 00:57:08.185 default/stage-0/default-step-0-0: /workspace/libgnt/./gntwidget.h:186: warning: Parameter description for gnt_widget_expose::x is missing in source code comment block.
24-Jan-2019 05:57:08 2019-01-24 00:57:08.185 default/stage-0/default-step-0-0: /workspace/libgnt/./gntwidget.h:186: warning: Parameter description for gnt_widget_expose::y is missing in source code comment block.
24-Jan-2019 05:57:08 2019-01-24 00:57:08.185 default/stage-0/default-step-0-0: /workspace/libgnt/./gntwidget.h:186: warning: Parameter description for gnt_widget_expose::width is missing in source code comment block.
24-Jan-2019 05:57:08 2019-01-24 00:57:08.185 default/stage-0/default-step-0-0: /workspace/libgnt/./gntwidget.h:186: warning: Parameter description for gnt_widget_expose::height is missing in source code comment block.
24-Jan-2019 05:57:08 2019-01-24 00:57:08.185 default/stage-0/default-step-0-0: /workspace/libgnt/./gntwidget.h:327: warning: Parameter description for gnt_widget_queue_update::widget is missing in source code comment block.
24-Jan-2019 05:57:08 2019-01-24 00:57:08.185 default/stage-0/default-step-0-0: unknown:0: warning: Value descriptions for GntWindowFlags are missing in source code comment block.
24-Jan-2019 05:57:08 2019-01-24 00:57:08.185 default/stage-0/default-step-0-0: unknown:0: warning: Value descriptions for GntKeyPressMode are missing in source code comment block.
24-Jan-2019 05:57:08 2019-01-24 00:57:08.185 default/stage-0/default-step-0-0: unknown:0: warning: Field descriptions for struct GntNode are missing in source code comment block.
24-Jan-2019 05:57:08 2019-01-24 00:57:08.185 default/stage-0/default-step-0-0: unknown:0: warning: Field descriptions for struct GntListWindow are missing in source code comment block.
24-Jan-2019 05:57:08 2019-01-24 00:57:08.185 default/stage-0/default-step-0-0: /workspace/libgnt/./gntwm.h:100: warning: Field description for GntWM::loop is missing in source code comment block.
24-Jan-2019 05:57:08 2019-01-24 00:57:08.185 default/stage-0/default-step-0-0: /workspace/libgnt/./gntwm.h:100: warning: Field description for GntWM::workspaces is missing in source code comment block.
24-Jan-2019 05:57:08 2019-01-24 00:57:08.185 default/stage-0/default-step-0-0: /workspace/libgnt/./gntwm.h:100: warning: Field description for GntWM::tagged is missing in source code comment block.
24-Jan-2019 05:57:08 2019-01-24 00:57:08.185 default/stage-0/default-step-0-0: /workspace/libgnt/./gntwm.h:100: warning: Field description for GntWM::cws is missing in source code comment block.
24-Jan-2019 05:57:08 2019-01-24 00:57:08.185 default/stage-0/default-step-0-0: /workspace/libgnt/./gntwm.h:100: warning: Field description for GntWM::_list is missing in source code comment block.
24-Jan-2019 05:57:08 2019-01-24 00:57:08.185 default/stage-0/default-step-0-0: /workspace/libgnt/./gntwm.h:100: warning: Field description for GntWM::windows is missing in source code comment block.
24-Jan-2019 05:57:08 2019-01-24 00:57:08.185 default/stage-0/default-step-0-0: /workspace/libgnt/./gntwm.h:100: warning: Field description for GntWM::actions is missing in source code comment block.
24-Jan-2019 05:57:08 2019-01-24 00:57:08.185 default/stage-0/default-step-0-0: /workspace/libgnt/./gntwm.h:100: warning: Field description for GntWM::nodes is missing in source code comment block.
24-Jan-2019 05:57:08 2019-01-24 00:57:08.185 default/stage-0/default-step-0-0: /workspace/libgnt/./gntwm.h:100: warning: Field description for GntWM::name_places is missing in source code comment block.
24-Jan-2019 05:57:08 2019-01-24 00:57:08.185 default/stage-0/default-step-0-0: /workspace/libgnt/./gntwm.h:100: warning: Field description for GntWM::title_places is missing in source code comment block.
24-Jan-2019 05:57:08 2019-01-24 00:57:08.185 default/stage-0/default-step-0-0: /workspace/libgnt/./gntwm.h:100: warning: Field description for GntWM::mode is missing in source code comment block.
24-Jan-2019 05:57:08 2019-01-24 00:57:08.185 default/stage-0/default-step-0-0: /workspace/libgnt/./gntwm.h:100: warning: Field description for GntWM::positions is missing in source code comment block.
24-Jan-2019 05:57:08 2019-01-24 00:57:08.185 default/stage-0/default-step-0-0: /workspace/libgnt/./gntwm.h:365: warning: Parameter description for gnt_wm_set_event_stack::wm is missing in source code comment block.
24-Jan-2019 05:57:08 2019-01-24 00:57:08.185 default/stage-0/default-step-0-0: /workspace/libgnt/./gntwm.h:365: warning: Parameter description for gnt_wm_set_event_stack::set is missing in source code comment block.
24-Jan-2019 05:57:08 2019-01-24 00:57:08.185 default/stage-0/default-step-0-0: /workspace/libgnt/./gntwm.h:372: warning: Parameter description for gnt_wm_copy_win::widget is missing in source code comment block.
24-Jan-2019 05:57:08 2019-01-24 00:57:08.185 default/stage-0/default-step-0-0: /workspace/libgnt/./gntwm.h:372: warning: Parameter description for gnt_wm_copy_win::node is missing in source code comment block.
24-Jan-2019 05:57:08 2019-01-24 00:57:08.185 default/stage-0/default-step-0-0: ./libgnt-unused.txt:1: warning: 20 unused declarations. They should be added to libgnt-sections.txt in the appropriate place.
24-Jan-2019 05:57:08 2019-01-24 00:57:08.185 default/stage-0/default-step-0-0:
24-Jan-2019 05:57:08 2019-01-24 00:57:08.185 default/stage-0/default-step-0-0: Warning: multiple "IDs" for constraint linkend: api-index-2.8.0.
24-Jan-2019 05:57:08 2019-01-24 00:57:08.185 default/stage-0/default-step-0-0: Warning: multiple "IDs" for constraint linkend: api-index-2.0.0.
24-Jan-2019 05:57:08 2019-01-24 00:57:08.185 default/stage-0/default-step-0-0: Warning: multiple "IDs" for constraint linkend: api-index-2.8.0.
24-Jan-2019 05:57:08 2019-01-24 00:57:08.185 default/stage-0/default-step-0-0: Warning: multiple "IDs" for constraint linkend: api-index-2.4.0.
24-Jan-2019 05:57:08 2019-01-24 00:57:08.185 default/stage-0/default-step-0-0: Warning: multiple "IDs" for constraint linkend: api-index-2.3.0.
24-Jan-2019 05:57:08 2019-01-24 00:57:08.185 default/stage-0/default-step-0-0: Warning: multiple "IDs" for constraint linkend: api-index-2.4.0.
24-Jan-2019 05:57:08 2019-01-24 00:57:08.185 default/stage-0/default-step-0-0: Warning: multiple "IDs" for constraint linkend: api-index-2.3.0.
24-Jan-2019 05:57:08 2019-01-24 00:57:08.185 default/stage-0/default-step-0-0: Warning: multiple "IDs" for constraint linkend: api-index-2.3.0.
24-Jan-2019 05:57:08 2019-01-24 00:57:08.185 default/stage-0/default-step-0-0: Warning: multiple "IDs" for constraint linkend: api-index-2.3.0.
24-Jan-2019 05:57:08 2019-01-24 00:57:08.185 default/stage-0/default-step-0-0: Warning: multiple "IDs" for constraint linkend: api-index-2.3.0.
24-Jan-2019 05:57:08 2019-01-24 00:57:08.185 default/stage-0/default-step-0-0: Warning: multiple "IDs" for constraint linkend: api-index-2.3.0.
24-Jan-2019 05:57:08 2019-01-24 00:57:08.185 default/stage-0/default-step-0-0: Warning: multiple "IDs" for constraint linkend: api-index-2.8.0.
24-Jan-2019 05:57:08 2019-01-24 00:57:08.185 default/stage-0/default-step-0-0: Warning: multiple "IDs" for constraint linkend: api-index-2.8.0.
24-Jan-2019 05:57:08 2019-01-24 00:57:08.185 default/stage-0/default-step-0-0: Warning: multiple "IDs" for constraint linkend: api-index-2.8.0.
24-Jan-2019 05:57:08 2019-01-24 00:57:08.185 default/stage-0/default-step-0-0: Warning: multiple "IDs" for constraint linkend: api-index-2.0.0.
24-Jan-2019 05:57:08 2019-01-24 00:57:08.185 default/stage-0/default-step-0-0: Warning: multiple "IDs" for constraint linkend: api-index-2.0.0.
24-Jan-2019 05:57:08 2019-01-24 00:57:08.185 default/stage-0/default-step-0-0: Warning: multiple "IDs" for constraint linkend: api-index-2.0.0.
24-Jan-2019 05:57:08 2019-01-24 00:57:08.185 default/stage-0/default-step-0-0: Warning: multiple "IDs" for constraint linkend: api-index-2.2.0.
24-Jan-2019 05:57:08 2019-01-24 00:57:08.185 default/stage-0/default-step-0-0: Warning: multiple "IDs" for constraint linkend: api-index-2.2.0.
24-Jan-2019 05:57:08 2019-01-24 00:57:08.185 default/stage-0/default-step-0-0: Warning: multiple "IDs" for constraint linkend: api-index-2.0.0.
24-Jan-2019 05:57:08 2019-01-24 00:57:08.185 default/stage-0/default-step-0-0: Warning: multiple "IDs" for constraint linkend: api-index-2.0.0.
24-Jan-2019 05:57:08 2019-01-24 00:57:08.185 default/stage-0/default-step-0-0: Warning: multiple "IDs" for constraint linkend: api-index-2.0.0.
24-Jan-2019 05:57:08 2019-01-24 00:57:08.185 default/stage-0/default-step-0-0: Warning: multiple "IDs" for constraint linkend: api-index-2.0.0.
24-Jan-2019 05:57:08 2019-01-24 00:57:08.185 default/stage-0/default-step-0-0: Warning: multiple "IDs" for constraint linkend: api-index-2.0.0.
24-Jan-2019 05:57:08 2019-01-24 00:57:08.185 default/stage-0/default-step-0-0: Warning: multiple "IDs" for constraint linkend: api-index-2.4.0.
24-Jan-2019 05:57:08 2019-01-24 00:57:08.185 default/stage-0/default-step-0-0: Warning: multiple "IDs" for constraint linkend: api-index-2.4.0.
24-Jan-2019 05:57:08 2019-01-24 00:57:08.185 default/stage-0/default-step-0-0: Warning: multiple "IDs" for constraint linkend: api-index-2.0.0.
24-Jan-2019 05:57:08 2019-01-24 00:57:08.185 default/stage-0/default-step-0-0: Warning: multiple "IDs" for constraint linkend: api-index-2.0.0.
24-Jan-2019 05:57:08 2019-01-24 00:57:08.185 default/stage-0/default-step-0-0: Warning: multiple "IDs" for constraint linkend: api-index-2.8.0.
24-Jan-2019 05:57:08 2019-01-24 00:57:08.185 default/stage-0/default-step-0-0: Warning: multiple "IDs" for constraint linkend: api-index-2.8.0.
24-Jan-2019 05:57:08 2019-01-24 00:57:08.185 default/stage-0/default-step-0-0: Warning: multiple "IDs" for constraint linkend: api-index-2.8.0.
24-Jan-2019 05:57:08 2019-01-24 00:57:08.185 default/stage-0/default-step-0-0: Warning: multiple "IDs" for constraint linkend: api-index-2.8.0.
24-Jan-2019 05:57:08 2019-01-24 00:57:08.185 default/stage-0/default-step-0-0: Warning: multiple "IDs" for constraint linkend: api-index-2.8.0.
24-Jan-2019 05:57:08 2019-01-24 00:57:08.185 default/stage-0/default-step-0-0: Warning: multiple "IDs" for constraint linkend: api-index-2.4.0.
24-Jan-2019 05:57:08 2019-01-24 00:57:08.185 default/stage-0/default-step-0-0: Warning: multiple "IDs" for constraint linkend: api-index-2.0.0.
24-Jan-2019 05:57:08 2019-01-24 00:57:08.185 default/stage-0/default-step-0-0: Warning: multiple "IDs" for constraint linkend: api-index-2.0.0.
24-Jan-2019 05:57:08 2019-01-24 00:57:08.185 default/stage-0/default-step-0-0: Warning: multiple "IDs" for constraint linkend: api-index-2.0.0.
24-Jan-2019 05:57:08 2019-01-24 00:57:08.185 default/stage-0/default-step-0-0: Warning: multiple "IDs" for constraint linkend: api-index-2.0.0.
24-Jan-2019 05:57:08 2019-01-24 00:57:08.185 default/stage-0/default-step-0-0: Warning: multiple "IDs" for constraint linkend: api-index-2.0.0.
24-Jan-2019 05:57:08 2019-01-24 00:57:08.185 default/stage-0/default-step-0-0: Warning: multiple "IDs" for constraint linkend: api-index-2.0.0.
24-Jan-2019 05:57:08 2019-01-24 00:57:08.185 default/stage-0/default-step-0-0: Warning: multiple "IDs" for constraint linkend: api-index-2.0.0.
24-Jan-2019 05:57:08 2019-01-24 00:57:08.185 default/stage-0/default-step-0-0: Warning: multiple "IDs" for constraint linkend: api-index-2.4.0.
24-Jan-2019 05:57:08 2019-01-24 00:57:08.185 default/stage-0/default-step-0-0: Warning: multiple "IDs" for constraint linkend: api-index-2.3.0.
24-Jan-2019 05:57:08 2019-01-24 00:57:08.185 default/stage-0/default-step-0-0: Warning: multiple "IDs" for constraint linkend: api-index-2.3.0.
24-Jan-2019 05:57:08 2019-01-24 00:57:08.185 default/stage-0/default-step-0-0: Warning: multiple "IDs" for constraint linkend: api-index-2.3.0.
24-Jan-2019 05:57:08 2019-01-24 00:57:08.185 default/stage-0/default-step-0-0: Warning: multiple "IDs" for constraint linkend: api-index-2.0.0.
24-Jan-2019 05:57:08 2019-01-24 00:57:08.185 default/stage-0/default-step-0-0: Warning: multiple "IDs" for constraint linkend: api-index-2.0.0.
24-Jan-2019 05:57:08 2019-01-24 00:57:08.185 default/stage-0/default-step-0-0: Warning: multiple "IDs" for constraint linkend: api-index-2.0.0.
24-Jan-2019 05:57:08 2019-01-24 00:57:08.185 default/stage-0/default-step-0-0: Warning: multiple "IDs" for constraint linkend: api-index-2.0.0.
24-Jan-2019 05:57:08 2019-01-24 00:57:08.185 default/stage-0/default-step-0-0: Warning: multiple "IDs" for constraint linkend: api-index-2.0.0.
24-Jan-2019 05:57:08 2019-01-24 00:57:08.185 default/stage-0/default-step-0-0: Warning: multiple "IDs" for constraint linkend: api-index-2.0.0.
24-Jan-2019 05:57:08 2019-01-24 00:57:08.185 default/stage-0/default-step-0-0: Warning: multiple "IDs" for constraint linkend: api-index-2.0.0.
24-Jan-2019 05:57:08 2019-01-24 00:57:08.185 default/stage-0/default-step-0-0: Warning: multiple "IDs" for constraint linkend: api-index-2.0.0.
24-Jan-2019 05:57:08 2019-01-24 00:57:08.185 default/stage-0/default-step-0-0: Warning: multiple "IDs" for constraint linkend: api-index-2.0.0.
24-Jan-2019 05:57:08 2019-01-24 00:57:08.185 default/stage-0/default-step-0-0: Warning: multiple "IDs" for constraint linkend: api-index-2.0.0.
24-Jan-2019 05:57:08 2019-01-24 00:57:08.185 default/stage-0/default-step-0-0: Warning: multiple "IDs" for constraint linkend: api-index-2.2.0.
24-Jan-2019 05:57:08 2019-01-24 00:57:08.185 default/stage-0/default-step-0-0: Warning: multiple "IDs" for constraint linkend: api-index-2.0.0.
24-Jan-2019 05:57:08 2019-01-24 00:57:08.434 default/stage-0/default-step-0-0:
24-Jan-2019 05:57:08 2019-01-24 00:57:08.434 default/stage-0/default-step-0-0: html/api-index-full.html:435: warning: no link for: "GNT-EXTRA-VERSION:CAPS" -> (GNT_EXTRA_VERSION).
24-Jan-2019 05:57:08 2019-01-24 00:57:08.434 default/stage-0/default-step-0-0: html/api-index-full.html:435: warning: no link for: "libgnt-gntversion" -> (gntversion).
24-Jan-2019 05:57:08 2019-01-24 00:57:08.434 default/stage-0/default-step-0-0: html/api-index-full.html:878: warning: no link for: "GNT-MAJOR-VERSION:CAPS" -> (GNT_MAJOR_VERSION).
24-Jan-2019 05:57:08 2019-01-24 00:57:08.434 default/stage-0/default-step-0-0: html/api-index-full.html:1014: warning: no link for: "GNT-MICRO-VERSION:CAPS" -> (GNT_MICRO_VERSION).
24-Jan-2019 05:57:08 2019-01-24 00:57:08.434 default/stage-0/default-step-0-0: html/api-index-full.html:1018: warning: no link for: "GNT-MINOR-VERSION:CAPS" -> (GNT_MINOR_VERSION).
24-Jan-2019 05:57:08 2019-01-24 00:57:08.434 default/stage-0/default-step-0-0: html/api-index-full.html:1027: warning: no link for: "NCURSES-HEADER:CAPS" -> (NCURSES_HEADER).
24-Jan-2019 05:57:08 2019-01-24 00:57:08.434 default/stage-0/default-step-0-0: html/api-index-full.html:1027: warning: no link for: "libgnt-gntconfig" -> (gntconfig).
24-Jan-2019 05:57:08 2019-01-24 00:57:08.434 default/stage-0/default-step-0-0: html/api-index-full.html:1561: warning: no link for: "USE-PYTHON:CAPS" -> (USE_PYTHON).
24-Jan-2019 05:57:08 2019-01-24 00:57:08.434 default/stage-0/default-step-0-0: html/api-index-full.html:1598: warning: no link for: "GNT-VERSION:CAPS" -> (GNT_VERSION).
24-Jan-2019 05:57:08 2019-01-24 00:57:08.434 default/stage-0/default-step-0-0: html/libgnt-gnt.html:244: warning: no link for: "NULL:CAPS" -> (<code class="literal">NULL</code>).
24-Jan-2019 05:57:08 2019-01-24 00:57:08.434 default/stage-0/default-step-0-0: html/libgnt-gnt.html:277: warning: no link for: "FALSE:CAPS" -> (<code class="literal">FALSE</code>).
24-Jan-2019 05:57:08 2019-01-24 00:57:08.434 default/stage-0/default-step-0-0: html/libgnt-gnt.html:277: warning: no link for: "TRUE:CAPS" -> (<code class="literal">TRUE</code>).
24-Jan-2019 05:57:08 2019-01-24 00:57:08.434 default/stage-0/default-step-0-0: html/libgnt-gnt.html:562: warning: no link for: "g-free" -> (<code class="function">g_free()</code>).
24-Jan-2019 05:57:08 2019-01-24 00:57:08.434 default/stage-0/default-step-0-0: html/libgnt-gntbindable.html:189: warning: no link for: "GList" -> (<span class="type">GList</span>).
24-Jan-2019 05:57:08 2019-01-24 00:57:08.434 default/stage-0/default-step-0-0: html/libgnt-gntcheckbox.html:100: warning: no link for: "G-SIGNAL-RUN-LAST:CAPS" -> (Run Last).
24-Jan-2019 05:57:08 2019-01-24 00:57:08.434 default/stage-0/default-step-0-0: html/libgnt-gntcolors.html:136: warning: no link for: "GKeyFile" -> (<span class="type">GKeyFile</span>).
24-Jan-2019 05:57:08 2019-01-24 00:57:08.434 default/stage-0/default-step-0-0: html/libgnt-gntfilesel.html:448: warning: no link for: "g-list-free" -> (<code class="function">g_list_free()</code>).
24-Jan-2019 05:57:08 2019-01-24 00:57:08.434 default/stage-0/default-step-0-0: html/libgnt-gntstyle.html:288: warning: no link for: "g-strfreev" -> (<code class="function">g_strfreev()</code>).
24-Jan-2019 05:57:08 2019-01-24 00:57:08.434 default/stage-0/default-step-0-0: html/libgnt-gntstyle.html:396: warning: no link for: "GType" -> (<span class="type">GType</span>).
24-Jan-2019 05:57:08 2019-01-24 00:57:08.434 default/stage-0/default-step-0-0: html/libgnt-gntstyle.html:397: warning: no link for: "GHashTable" -> (<span class="type">GHashTable</span>).
24-Jan-2019 05:57:08 2019-01-24 00:57:08.434 default/stage-0/default-step-0-0: html/libgnt-gnttree.html:1675: warning: no link for: "GCompareFunc" -> (<span class="type">GCompareFunc</span>).
24-Jan-2019 05:57:08 2019-01-24 00:57:08.434 default/stage-0/default-step-0-0: html/libgnt-gntutils.html:295: warning: no link for: "GHashFunc" -> (<span class="type">GHashFunc</span>).
24-Jan-2019 05:57:08 2019-01-24 00:57:08.434 default/stage-0/default-step-0-0: html/libgnt-gntutils.html:296: warning: no link for: "GEqualFunc" -> (<span class="type">GEqualFunc</span>).
24-Jan-2019 05:57:08 2019-01-24 00:57:08.434 default/stage-0/default-step-0-0: html/libgnt-gntutils.html:297: warning: no link for: "GDestroyNotify" -> (<span class="type">GDestroyNotify</span>).
24-Jan-2019 05:57:08 2019-01-24 00:57:08.434 default/stage-0/default-step-0-0: html/libgnt-gntutils.html:359: warning: no link for: "GSignalInvocationHint" -> (<span class="type">GSignalInvocationHint</span>).
24-Jan-2019 05:57:08 2019-01-24 00:57:08.434 default/stage-0/default-step-0-0: html/libgnt-gntutils.html:360: warning: no link for: "GValue" -> (<span class="type">GValue</span>).
24-Jan-2019 05:57:08 2019-01-24 00:57:08.434 default/stage-0/default-step-0-0: html/libgnt-gntwm.html:972: warning: no link for: "GMainLoop" -> (<span class="type">GMainLoop</span>).
24-Jan-2019 05:57:08 2019-01-24 00:57:08.434 default/stage-0/default-step-0-0:
24-Jan-2019 05:57:08 2019-01-24 00:57:08.469 default/stage-0/default-step-0-0: Installing libgnt.so.1.9.0 to /usr/lib/x86_64-linux-gnu
24-Jan-2019 05:57:08 2019-01-24 00:57:08.469 default/stage-0/default-step-0-0: Installing Gnt-2.9.gir to /usr/share/gir-1.0
24-Jan-2019 05:57:08 2019-01-24 00:57:08.469 default/stage-0/default-step-0-0: Installing Gnt-2.9.typelib to /usr/lib/x86_64-linux-gnu/girepository-1.0
24-Jan-2019 05:57:08 2019-01-24 00:57:08.469 default/stage-0/default-step-0-0: Installing wms/irssi.so to /usr/lib/x86_64-linux-gnu/gnt
24-Jan-2019 05:57:08 2019-01-24 00:57:08.469 default/stage-0/default-step-0-0: Installing wms/s.so to /usr/lib/x86_64-linux-gnu/gnt
24-Jan-2019 05:57:08 2019-01-24 00:57:08.469 default/stage-0/default-step-0-0: Installing /workspace/libgnt/gntwidget.h to /usr/include/gnt
24-Jan-2019 05:57:08 2019-01-24 00:57:08.469 default/stage-0/default-step-0-0: Installing /workspace/libgnt/gntbindable.h to /usr/include/gnt
24-Jan-2019 05:57:08 2019-01-24 00:57:08.469 default/stage-0/default-step-0-0: Installing /workspace/libgnt/gntbox.h to /usr/include/gnt
24-Jan-2019 05:57:08 2019-01-24 00:57:08.469 default/stage-0/default-step-0-0: Installing /workspace/libgnt/gntbutton.h to /usr/include/gnt
24-Jan-2019 05:57:08 2019-01-24 00:57:08.469 default/stage-0/default-step-0-0: Installing /workspace/libgnt/gntcheckbox.h to /usr/include/gnt
24-Jan-2019 05:57:08 2019-01-24 00:57:08.469 default/stage-0/default-step-0-0: Installing /workspace/libgnt/gntclipboard.h to /usr/include/gnt
24-Jan-2019 05:57:08 2019-01-24 00:57:08.469 default/stage-0/default-step-0-0: Installing /workspace/libgnt/gntcolors.h to /usr/include/gnt
24-Jan-2019 05:57:08 2019-01-24 00:57:08.469 default/stage-0/default-step-0-0: Installing /workspace/libgnt/gntcombobox.h to /usr/include/gnt
24-Jan-2019 05:57:08 2019-01-24 00:57:08.469 default/stage-0/default-step-0-0: Installing /workspace/libgnt/gntentry.h to /usr/include/gnt
24-Jan-2019 05:57:08 2019-01-24 00:57:08.469 default/stage-0/default-step-0-0: Installing /workspace/libgnt/gntfilesel.h to /usr/include/gnt
24-Jan-2019 05:57:08 2019-01-24 00:57:08.469 default/stage-0/default-step-0-0: Installing /workspace/libgnt/gntkeys.h to /usr/include/gnt
24-Jan-2019 05:57:08 2019-01-24 00:57:08.469 default/stage-0/default-step-0-0: Installing /workspace/libgnt/gntlabel.h to /usr/include/gnt
24-Jan-2019 05:57:08 2019-01-24 00:57:08.469 default/stage-0/default-step-0-0: Installing /workspace/libgnt/gntline.h to /usr/include/gnt
24-Jan-2019 05:57:08 2019-01-24 00:57:08.469 default/stage-0/default-step-0-0: Installing /workspace/libgnt/gntmenu.h to /usr/include/gnt
24-Jan-2019 05:57:08 2019-01-24 00:57:08.469 default/stage-0/default-step-0-0: Installing /workspace/libgnt/gntmenuitem.h to /usr/include/gnt
24-Jan-2019 05:57:08 2019-01-24 00:57:08.469 default/stage-0/default-step-0-0: Installing /workspace/libgnt/gntmenuitemcheck.h to /usr/include/gnt
24-Jan-2019 05:57:08 2019-01-24 00:57:08.469 default/stage-0/default-step-0-0: Installing /workspace/libgnt/gntprogressbar.h to /usr/include/gnt
24-Jan-2019 05:57:08 2019-01-24 00:57:08.469 default/stage-0/default-step-0-0: Installing /workspace/libgnt/gntslider.h to /usr/include/gnt
24-Jan-2019 05:57:08 2019-01-24 00:57:08.469 default/stage-0/default-step-0-0: Installing /workspace/libgnt/gntstyle.h to /usr/include/gnt
24-Jan-2019 05:57:08 2019-01-24 00:57:08.469 default/stage-0/default-step-0-0: Installing /workspace/libgnt/gnttextview.h to /usr/include/gnt
24-Jan-2019 05:57:08 2019-01-24 00:57:08.469 default/stage-0/default-step-0-0: Installing /workspace/libgnt/gnttree.h to /usr/include/gnt
24-Jan-2019 05:57:08 2019-01-24 00:57:08.469 default/stage-0/default-step-0-0: Installing /workspace/libgnt/gntutils.h to /usr/include/gnt
24-Jan-2019 05:57:08 2019-01-24 00:57:08.469 default/stage-0/default-step-0-0: Installing /workspace/libgnt/gntwindow.h to /usr/include/gnt
24-Jan-2019 05:57:08 2019-01-24 00:57:08.469 default/stage-0/default-step-0-0: Installing /workspace/libgnt/gntwm.h to /usr/include/gnt
24-Jan-2019 05:57:08 2019-01-24 00:57:08.469 default/stage-0/default-step-0-0: Installing /workspace/libgnt/gntws.h to /usr/include/gnt
24-Jan-2019 05:57:08 2019-01-24 00:57:08.469 default/stage-0/default-step-0-0: Installing /workspace/libgnt/build/gntversion.h to /usr/include/gnt
24-Jan-2019 05:57:08 2019-01-24 00:57:08.469 default/stage-0/default-step-0-0: Installing /workspace/libgnt/build/gnt.h to /usr/include/gnt
24-Jan-2019 05:57:08 2019-01-24 00:57:08.469 default/stage-0/default-step-0-0: Installing /workspace/libgnt/build/meson-private/gnt.pc to /usr/lib/x86_64-linux-gnu/pkgconfig
24-Jan-2019 05:57:08 2019-01-24 00:57:08.469 default/stage-0/default-step-0-0: Running custom install script '/usr/bin/python3 /usr/bin/meson --internal gtkdoc --sourcedir=/workspace/libgnt --builddir=/workspace/libgnt/build --subdir=doc --headerdirs=/workspace/libgnt/.@@/workspace/libgnt/build/. --mainfile=libgnt-docs.xml --modulename=libgnt --mode=auto --scanargs=--deprecated-guards=GNT_DISABLE_DEPRECATED@@--rebuild-types@@--rebuild-sections@@--ignore-headers=test wms gntinternal.h gnt-skel.h --gobjects-types-file=/workspace/libgnt/doc/libgnt.types --mkdbargs=--ignore-files=test wms gntinternal.h gnt-skel.h --content-files= --cflags=-I/workspace/libgnt/build/. -I/workspace/libgnt/. -D_DEFAULT_SOURCE -D_XOPEN_SOURCE=600 -I/usr/include/libxml2 -I/usr/include/glib-2.0 -I/usr/lib/x86_64-linux-gnu/glib-2.0/include -pthread -I/usr/include/python3.6m -I/usr/include/x86_64-linux-gnu/python3.6m --ldflags=-L/workspace/libgnt/build/ -Wl,-rpath,/workspace/libgnt/build/ -lgnt -lncursesw -ltinfo -lpanelw -lxml2 -lglib-2.0 -lgobject-2.0 -lgmodule-2.0 -pthread -lpython3.6m --cc=cc --ld=cc'
24-Jan-2019 05:57:08 2019-01-24 00:57:08.513 default/stage-0/default-step-0-0: + ldconfig
24-Jan-2019 05:57:09 2019-01-24 00:57:09.124 default/stage-0/default-step-0-0: + meson -Dsilc=false -Ddoc=true -Dconsole-logging=true build-pipelines
24-Jan-2019 05:57:14 2019-01-24 00:57:14.677 default/stage-0/default-step-0-0: The Meson build system
24-Jan-2019 05:57:14 2019-01-24 00:57:14.677 default/stage-0/default-step-0-0: Version: 0.47.2
24-Jan-2019 05:57:14 2019-01-24 00:57:14.677 default/stage-0/default-step-0-0: Source dir: /workspace
24-Jan-2019 05:57:14 2019-01-24 00:57:14.677 default/stage-0/default-step-0-0: Build dir: /workspace/build-pipelines
24-Jan-2019 05:57:14 2019-01-24 00:57:14.677 default/stage-0/default-step-0-0: Build type: native build
24-Jan-2019 05:57:14 2019-01-24 00:57:14.677 default/stage-0/default-step-0-0: Project name: pidgin
24-Jan-2019 05:57:14 2019-01-24 00:57:14.677 default/stage-0/default-step-0-0: Project version: undefined
24-Jan-2019 05:57:14 2019-01-24 00:57:14.677 default/stage-0/default-step-0-0: Native C compiler: cc (gcc 8.2.0 "cc (Debian 8.2.0-6) 8.2.0")
24-Jan-2019 05:57:14 2019-01-24 00:57:14.677 default/stage-0/default-step-0-0: Build machine cpu family: x86_64
24-Jan-2019 05:57:14 2019-01-24 00:57:14.677 default/stage-0/default-step-0-0: Build machine cpu: x86_64
24-Jan-2019 05:57:14 2019-01-24 00:57:14.677 default/stage-0/default-step-0-0: Found mercurial repository at /workspace
24-Jan-2019 05:57:14 2019-01-24 00:57:14.677 default/stage-0/default-step-0-0: Program sed found: YES (/usr/bin/sed)
24-Jan-2019 05:57:14 2019-01-24 00:57:14.677 default/stage-0/default-step-0-0: Program mkmesonconf.py found: YES (/workspace/mkmesonconf.py)
24-Jan-2019 05:57:14 2019-01-24 00:57:14.677 default/stage-0/default-step-0-0: Has header "sys/wait.h": YES
24-Jan-2019 05:57:14 2019-01-24 00:57:14.677 default/stage-0/default-step-0-0: Has header "fcntl.h": YES
24-Jan-2019 05:57:14 2019-01-24 00:57:14.677 default/stage-0/default-step-0-0: Has header "unistd.h": YES
24-Jan-2019 05:57:14 2019-01-24 00:57:14.677 default/stage-0/default-step-0-0: Has header "stdint.h": YES
24-Jan-2019 05:57:14 2019-01-24 00:57:14.677 default/stage-0/default-step-0-0: Checking for size of "time_t": 8
24-Jan-2019 05:57:14 2019-01-24 00:57:14.677 default/stage-0/default-step-0-0: Checking for function "inet_aton" : YES
24-Jan-2019 05:57:14 2019-01-24 00:57:14.677 default/stage-0/default-step-0-0: Checking for function "gethostent" : YES
24-Jan-2019 05:57:14 2019-01-24 00:57:14.677 default/stage-0/default-step-0-0: Checking for function "socket" : YES
24-Jan-2019 05:57:14 2019-01-24 00:57:14.677 default/stage-0/default-step-0-0: Checking for function "getaddrinfo" : YES
24-Jan-2019 05:57:14 2019-01-24 00:57:14.677 default/stage-0/default-step-0-0: Checking for function "inet_ntop" : YES
24-Jan-2019 05:57:14 2019-01-24 00:57:14.677 default/stage-0/default-step-0-0: Checking for function "getifaddrs" : YES
24-Jan-2019 05:57:14 2019-01-24 00:57:14.677 default/stage-0/default-step-0-0: Header <sys/socket.h> has symbol "socklen_t": YES
24-Jan-2019 05:57:14 2019-01-24 00:57:14.677 default/stage-0/default-step-0-0: Checking whether type "struct sockaddr" has member "sa_len" : NO
24-Jan-2019 05:57:14 2019-01-24 00:57:14.677 default/stage-0/default-step-0-0: Header <netinet/in.h> has symbol "IPV6_V6ONLY": YES
24-Jan-2019 05:57:14 2019-01-24 00:57:14.677 default/stage-0/default-step-0-0: Library m found: YES
24-Jan-2019 05:57:14 2019-01-24 00:57:14.677 default/stage-0/default-step-0-0: Found pkg-config: /usr/bin/pkg-config (0.29)
24-Jan-2019 05:57:14 2019-01-24 00:57:14.677 default/stage-0/default-step-0-0: Native dependency glib-2.0 found: YES 2.56.1
24-Jan-2019 05:57:14 2019-01-24 00:57:14.677 default/stage-0/default-step-0-0: Native dependency gio-2.0 found: YES 2.56.1
24-Jan-2019 05:57:14 2019-01-24 00:57:14.677 default/stage-0/default-step-0-0: Native dependency gobject-2.0 found: YES 2.56.1
24-Jan-2019 05:57:14 2019-01-24 00:57:14.677 default/stage-0/default-step-0-0: Native dependency gthread-2.0 found: YES 2.56.1
24-Jan-2019 05:57:14 2019-01-24 00:57:14.677 default/stage-0/default-step-0-0: Native dependency gtk+-3.0 found: YES 3.22.30
24-Jan-2019 05:57:14 2019-01-24 00:57:14.677 default/stage-0/default-step-0-0: Native dependency webkitgtk-3.0 found: YES 2.4.11
24-Jan-2019 05:57:14 2019-01-24 00:57:14.677 default/stage-0/default-step-0-0: Native dependency talkatu found: YES 0.1.0-dev
24-Jan-2019 05:57:14 2019-01-24 00:57:14.677 default/stage-0/default-step-0-0: Native dependency enchant found: YES 1.6.0
24-Jan-2019 05:57:14 2019-01-24 00:57:14.677 default/stage-0/default-step-0-0: Native dependency x11 found: YES 1.6.6
24-Jan-2019 05:57:14 2019-01-24 00:57:14.677 default/stage-0/default-step-0-0: Native dependency libxml-2.0 found: YES 2.9.4
24-Jan-2019 05:57:14 2019-01-24 00:57:14.677 default/stage-0/default-step-0-0: Native dependency json-glib-1.0 found: YES 1.4.2
24-Jan-2019 05:57:14 2019-01-24 00:57:14.677 default/stage-0/default-step-0-0: Native dependency gstreamer-1.0 found: YES 1.14.2
24-Jan-2019 05:57:14 2019-01-24 00:57:14.677 default/stage-0/default-step-0-0: Native dependency gstreamer-video-1.0 found: YES 1.14.2
24-Jan-2019 05:57:14 2019-01-24 00:57:14.677 default/stage-0/default-step-0-0: Native dependency farstream-0.2 found: YES 0.2.8
24-Jan-2019 05:57:14 2019-01-24 00:57:14.677 default/stage-0/default-step-0-0: Native dependency gstreamer-app-1.0 found: YES 1.14.2
24-Jan-2019 05:57:14 2019-01-24 00:57:14.677 default/stage-0/default-step-0-0: Native dependency meanwhile found: YES 1.0.2
24-Jan-2019 05:57:14 2019-01-24 00:57:14.677 default/stage-0/default-step-0-0: Native dependency avahi-client found: YES 0.7
24-Jan-2019 05:57:14 2019-01-24 00:57:14.677 default/stage-0/default-step-0-0: Native dependency avahi-glib found: YES 0.7
24-Jan-2019 05:57:14 2019-01-24 00:57:14.677 default/stage-0/default-step-0-0: Native dependency libgadu found: YES 1.12.2
24-Jan-2019 05:57:14 2019-01-24 00:57:14.677 default/stage-0/default-step-0-0: Checking for function "gg_is_gpl_compliant" : YES
24-Jan-2019 05:57:14 2019-01-24 00:57:14.677 default/stage-0/default-step-0-0: Has header "sys/utsname.h": YES
24-Jan-2019 05:57:14 2019-01-24 00:57:14.680 default/stage-0/default-step-0-0: Checking for function "uname" : YES
24-Jan-2019 05:57:14 2019-01-24 00:57:14.680 default/stage-0/default-step-0-0: Compiler for C supports arguments -Waggregate-return: YES
24-Jan-2019 05:57:14 2019-01-24 00:57:14.680 default/stage-0/default-step-0-0: Compiler for C supports arguments -Wcast-align: YES
24-Jan-2019 05:57:14 2019-01-24 00:57:14.680 default/stage-0/default-step-0-0: Compiler for C supports arguments -Wdeclaration-after-statement: YES
24-Jan-2019 05:57:14 2019-01-24 00:57:14.680 default/stage-0/default-step-0-0: Compiler for C supports arguments -Wendif-labels: YES
24-Jan-2019 05:57:14 2019-01-24 00:57:14.680 default/stage-0/default-step-0-0: Compiler for C supports arguments -Werror-implicit-function-declaration: YES
24-Jan-2019 05:57:14 2019-01-24 00:57:14.680 default/stage-0/default-step-0-0: Compiler for C supports arguments -Wextra -Wno-unused-parameter: NO
24-Jan-2019 05:57:14 2019-01-24 00:57:14.680 default/stage-0/default-step-0-0: Compiler for C supports arguments -Wformat: YES
24-Jan-2019 05:57:14 2019-01-24 00:57:14.680 default/stage-0/default-step-0-0: Compiler for C supports arguments -Wformat-security: YES
24-Jan-2019 05:57:14 2019-01-24 00:57:14.680 default/stage-0/default-step-0-0: Compiler for C supports arguments -Werror=format-security: NO
24-Jan-2019 05:57:14 2019-01-24 00:57:14.680 default/stage-0/default-step-0-0: Compiler for C supports arguments -Winit-self: YES
24-Jan-2019 05:57:14 2019-01-24 00:57:14.680 default/stage-0/default-step-0-0: Compiler for C supports arguments -Wmissing-declarations: YES
24-Jan-2019 05:57:14 2019-01-24 00:57:14.680 default/stage-0/default-step-0-0: Compiler for C supports arguments -Wmissing-noreturn: YES
24-Jan-2019 05:57:14 2019-01-24 00:57:14.680 default/stage-0/default-step-0-0: Compiler for C supports arguments -Wmissing-prototypes: YES
24-Jan-2019 05:57:14 2019-01-24 00:57:14.680 default/stage-0/default-step-0-0: Compiler for C supports arguments -Wpointer-arith: YES
24-Jan-2019 05:57:14 2019-01-24 00:57:14.680 default/stage-0/default-step-0-0: Compiler for C supports arguments -Wfloat-equal: YES
24-Jan-2019 05:57:14 2019-01-24 00:57:14.680 default/stage-0/default-step-0-0: Compiler for C supports arguments -Wundef: YES
24-Jan-2019 05:57:14 2019-01-24 00:57:14.680 default/stage-0/default-step-0-0: Program pidgin found: NO
24-Jan-2019 05:57:14 2019-01-24 00:57:14.680 default/stage-0/default-step-0-0: Native dependency libsecret-1 found: YES 0.18.6
24-Jan-2019 05:57:14 2019-01-24 00:57:14.680 default/stage-0/default-step-0-0: Native dependency gplugin found: YES 0.28.0dev
24-Jan-2019 05:57:14 2019-01-24 00:57:14.680 default/stage-0/default-step-0-0: Native dependency gobject-introspection-1.0 found: YES 1.56.1
24-Jan-2019 05:57:14 2019-01-24 00:57:14.680 default/stage-0/default-step-0-0: Native dependency nettle found: YES 3.4
24-Jan-2019 05:57:14 2019-01-24 00:57:14.680 default/stage-0/default-step-0-0: Checking for function "snprintf" : YES
24-Jan-2019 05:57:14 2019-01-24 00:57:14.680 default/stage-0/default-step-0-0: Checking for function "connect" : YES
24-Jan-2019 05:57:14 2019-01-24 00:57:14.681 default/stage-0/default-step-0-0: Checking for function "gethostid" : YES
24-Jan-2019 05:57:14 2019-01-24 00:57:14.681 default/stage-0/default-step-0-0: Checking for function "timegm" : YES
24-Jan-2019 05:57:14 2019-01-24 00:57:14.681 default/stage-0/default-step-0-0: Has header "paths.h": YES
24-Jan-2019 05:57:14 2019-01-24 00:57:14.681 default/stage-0/default-step-0-0: Has header "sgtty.h": YES
24-Jan-2019 05:57:14 2019-01-24 00:57:14.681 default/stage-0/default-step-0-0: Has header "sys/cdefs.h": YES
24-Jan-2019 05:57:14 2019-01-24 00:57:14.681 default/stage-0/default-step-0-0: Has header "sys/file.h": YES
24-Jan-2019 05:57:14 2019-01-24 00:57:14.681 default/stage-0/default-step-0-0: Has header "sys/filio.h": NO
24-Jan-2019 05:57:14 2019-01-24 00:57:14.681 default/stage-0/default-step-0-0: Has header "sys/ioctl.h": YES
24-Jan-2019 05:57:14 2019-01-24 00:57:14.681 default/stage-0/default-step-0-0: Has header "sys/msgbuf.h": NO
24-Jan-2019 05:57:14 2019-01-24 00:57:14.681 default/stage-0/default-step-0-0: Has header "sys/select.h": YES
24-Jan-2019 05:57:14 2019-01-24 00:57:14.681 default/stage-0/default-step-0-0: Has header "sys/uio.h": YES
24-Jan-2019 05:57:14 2019-01-24 00:57:14.681 default/stage-0/default-step-0-0: Has header "sys/utsname.h": YES
24-Jan-2019 05:57:14 2019-01-24 00:57:14.681 default/stage-0/default-step-0-0: Has header "sys/wait.h": YES
24-Jan-2019 05:57:14 2019-01-24 00:57:14.681 default/stage-0/default-step-0-0: Has header "termios.h": YES
24-Jan-2019 05:57:14 2019-01-24 00:57:14.681 default/stage-0/default-step-0-0: Has header "sys/param.h": YES
24-Jan-2019 05:57:14 2019-01-24 00:57:14.681 default/stage-0/default-step-0-0: Has header "sys/sysctl.h": YES
24-Jan-2019 05:57:14 2019-01-24 00:57:14.681 default/stage-0/default-step-0-0: Has header "sys/socket.h": YES
24-Jan-2019 05:57:14 2019-01-24 00:57:14.681 default/stage-0/default-step-0-0: Configuring purple.h using configuration
24-Jan-2019 05:57:14 2019-01-24 00:57:14.681 default/stage-0/default-step-0-0: Configuring version.h using configuration
24-Jan-2019 05:57:14 2019-01-24 00:57:14.681 default/stage-0/default-step-0-0: WARNING: Project targetting '>=0.37.0' but tried to use feature introduced in '0.41.0': variables arg in pkgconfig.generate
24-Jan-2019 05:57:14 2019-01-24 00:57:14.681 default/stage-0/default-step-0-0: WARNING: Project targetting '>=0.37.0' but tried to use feature introduced in '0.41.0': custom pkgconfig variables
24-Jan-2019 05:57:14 2019-01-24 00:57:14.681 default/stage-0/default-step-0-0: Native dependency gobject-introspection-1.0 found: YES 1.56.1
24-Jan-2019 05:57:14 2019-01-24 00:57:14.681 default/stage-0/default-step-0-0: Native dependency libidn found: YES 1.33
24-Jan-2019 05:57:14 2019-01-24 00:57:14.681 default/stage-0/default-step-0-0: Native dependency gnt found: YES 2.9.0-devel
24-Jan-2019 05:57:14 2019-01-24 00:57:14.681 default/stage-0/default-step-0-0: Native dependency ncursesw found: YES 6.1.20180714
24-Jan-2019 05:57:14 2019-01-24 00:57:14.681 default/stage-0/default-step-0-0: Header <ncurses.h> has symbol "get_wch": YES
24-Jan-2019 05:57:14 2019-01-24 00:57:14.681 default/stage-0/default-step-0-0: Header <ncursesw/ncurses.h> has symbol "get_wch": YES
24-Jan-2019 05:57:14 2019-01-24 00:57:14.681 default/stage-0/default-step-0-0: Native dependency glib-2.0 found: YES 2.56.1
24-Jan-2019 05:57:14 2019-01-24 00:57:14.681 default/stage-0/default-step-0-0: Configuring im.pidgin.Pidgin.desktop.in using configuration
24-Jan-2019 05:57:14 2019-01-24 00:57:14.681 default/stage-0/default-step-0-0: WARNING: Project targetting '>=0.37.0' but tried to use feature introduced in '0.42.0': exclude_files arg in install_subdir
24-Jan-2019 05:57:14 2019-01-24 00:57:14.681 default/stage-0/default-step-0-0: WARNING: Project targetting '>=0.37.0' but tried to use feature introduced in '0.42.0': exclude_directories arg in install_subdir
24-Jan-2019 05:57:14 2019-01-24 00:57:14.681 default/stage-0/default-step-0-0: Configuring version.xml using configuration
24-Jan-2019 05:57:14 2019-01-24 00:57:14.681 default/stage-0/default-step-0-0: Configuring version.xml using configuration
24-Jan-2019 05:57:14 2019-01-24 00:57:14.681 default/stage-0/default-step-0-0: Configuring version.xml using configuration
24-Jan-2019 05:57:14 2019-01-24 00:57:14.681 default/stage-0/default-step-0-0: Configuring pidgin.1 using configuration
24-Jan-2019 05:57:14 2019-01-24 00:57:14.681 default/stage-0/default-step-0-0: Configuring finch.1 using configuration
24-Jan-2019 05:57:14 2019-01-24 00:57:14.681 default/stage-0/default-step-0-0: Configuring config.h using configuration
24-Jan-2019 05:57:14 2019-01-24 00:57:14.681 default/stage-0/default-step-0-0: Message:
24-Jan-2019 05:57:14 2019-01-24 00:57:14.681 default/stage-0/default-step-0-0: Message: pidgin 3.0.0devel
24-Jan-2019 05:57:14 2019-01-24 00:57:14.681 default/stage-0/default-step-0-0: Message:
24-Jan-2019 05:57:14 2019-01-24 00:57:14.681 default/stage-0/default-step-0-0: Message: Build GTK+ UI................. : true
24-Jan-2019 05:57:14 2019-01-24 00:57:14.681 default/stage-0/default-step-0-0: Message: Build console UI.............. : true
24-Jan-2019 05:57:14 2019-01-24 00:57:14.681 default/stage-0/default-step-0-0: Message: Build for X11................. : true
24-Jan-2019 05:57:14 2019-01-24 00:57:14.681 default/stage-0/default-step-0-0: Message:
24-Jan-2019 05:57:14 2019-01-24 00:57:14.681 default/stage-0/default-step-0-0: Message: Enable Gestures............... : true
24-Jan-2019 05:57:14 2019-01-24 00:57:14.681 default/stage-0/default-step-0-0: Message: Protocols to build dynamically : ['bonjour', 'facebook', 'gg', 'irc', 'jabber', 'novell', 'oscar', 'sametime', 'simple', 'zephyr']
24-Jan-2019 05:57:14 2019-01-24 00:57:14.681 default/stage-0/default-step-0-0: Message:
24-Jan-2019 05:57:14 2019-01-24 00:57:14.681 default/stage-0/default-step-0-0: Message: Build with GStreamer support.. : true
24-Jan-2019 05:57:14 2019-01-24 00:57:14.681 default/stage-0/default-step-0-0: Message: Build with voice and video.... : true
24-Jan-2019 05:57:14 2019-01-24 00:57:14.681 default/stage-0/default-step-0-0: Message: Build with GNU Libidn......... : true
24-Jan-2019 05:57:14 2019-01-24 00:57:14.681 default/stage-0/default-step-0-0: Message: Build with Nettle support..... : true
24-Jan-2019 05:57:14 2019-01-24 00:57:14.681 default/stage-0/default-step-0-0: Message: Build with Cyrus SASL support. : false
24-Jan-2019 05:57:14 2019-01-24 00:57:14.681 default/stage-0/default-step-0-0: Message: Use kerberos 4 with zephyr.... : false
24-Jan-2019 05:57:14 2019-01-24 00:57:14.681 default/stage-0/default-step-0-0: Message: Use external libzephyr........ : false
24-Jan-2019 05:57:14 2019-01-24 00:57:14.681 default/stage-0/default-step-0-0: Message: Install pixmaps............... : true
24-Jan-2019 05:57:14 2019-01-24 00:57:14.681 default/stage-0/default-step-0-0: Message: Install translations.......... : true
24-Jan-2019 05:57:14 2019-01-24 00:57:14.681 default/stage-0/default-step-0-0: Message: Has you....................... : yes
24-Jan-2019 05:57:14 2019-01-24 00:57:14.681 default/stage-0/default-step-0-0: Message:
24-Jan-2019 05:57:14 2019-01-24 00:57:14.681 default/stage-0/default-step-0-0: Message: Build with Enchant support.... : true
24-Jan-2019 05:57:14 2019-01-24 00:57:14.681 default/stage-0/default-step-0-0: Message: Build Unity integration plugin.: false
24-Jan-2019 05:57:14 2019-01-24 00:57:14.681 default/stage-0/default-step-0-0: Message:
24-Jan-2019 05:57:14 2019-01-24 00:57:14.681 default/stage-0/default-step-0-0: Message: Build with KWallet............ : false
24-Jan-2019 05:57:14 2019-01-24 00:57:14.681 default/stage-0/default-step-0-0: Message: Build with Secret Service..... : true
24-Jan-2019 05:57:14 2019-01-24 00:57:14.681 default/stage-0/default-step-0-0: Message:
24-Jan-2019 05:57:14 2019-01-24 00:57:14.681 default/stage-0/default-step-0-0: Message: Build plugins................. : true
24-Jan-2019 05:57:14 2019-01-24 00:57:14.681 default/stage-0/default-step-0-0: Message: Enable Introspection...........: true
24-Jan-2019 05:57:14 2019-01-24 00:57:14.681 default/stage-0/default-step-0-0: Message:
24-Jan-2019 05:57:14 2019-01-24 00:57:14.681 default/stage-0/default-step-0-0: Message: Print debugging messages...... : true
24-Jan-2019 05:57:14 2019-01-24 00:57:14.681 default/stage-0/default-step-0-0: Message: Generate documentation........ : true
24-Jan-2019 05:57:14 2019-01-24 00:57:14.682 default/stage-0/default-step-0-0: Message:
24-Jan-2019 05:57:14 2019-01-24 00:57:14.682 default/stage-0/default-step-0-0: Message: Pidgin will be installed in /usr/local/bin.
24-Jan-2019 05:57:14 2019-01-24 00:57:14.682 default/stage-0/default-step-0-0: Message:
24-Jan-2019 05:57:14 2019-01-24 00:57:14.682 default/stage-0/default-step-0-0: Message: configure complete, now type 'ninja'
24-Jan-2019 05:57:14 2019-01-24 00:57:14.682 default/stage-0/default-step-0-0: Message:
24-Jan-2019 05:57:14 2019-01-24 00:57:14.682 default/stage-0/default-step-0-0: Build targets in project: 96
24-Jan-2019 05:57:14 2019-01-24 00:57:14.682 default/stage-0/default-step-0-0: WARNING: Project specifies a minimum meson_version '>=0.37.0' but uses features which were added in newer versions:
24-Jan-2019 05:57:14 2019-01-24 00:57:14.682 default/stage-0/default-step-0-0: * 0.41.0: {'custom pkgconfig variables', 'variables arg in pkgconfig.generate'}
24-Jan-2019 05:57:14 2019-01-24 00:57:14.682 default/stage-0/default-step-0-0: * 0.42.0: {'exclude_directories arg in install_subdir', 'exclude_files arg in install_subdir'}
24-Jan-2019 05:57:14 2019-01-24 00:57:14.682 default/stage-0/default-step-0-0: Found ninja-1.8.2 at /usr/bin/ninja
24-Jan-2019 05:57:14 2019-01-24 00:57:14.752 default/stage-0/default-step-0-0: + ninja -C build-pipelines
24-Jan-2019 05:57:14 2019-01-24 00:57:14.756 default/stage-0/default-step-0-0: ninja: Entering directory `build-pipelines'
24-Jan-2019 05:57:14 2019-01-24 00:57:14.799 default/stage-0/default-step-0-0: [1/501] Generating pidginresources_h with a custom command.
24-Jan-2019 05:57:14 2019-01-24 00:57:14.812 default/stage-0/default-step-0-0: [2/501] Generating pidginresources_c with a custom command.
24-Jan-2019 05:57:15 2019-01-24 00:57:15.103 default/stage-0/default-step-0-0: [3/501] Generating small-theme with a meson_exe.py custom command.
24-Jan-2019 05:57:15 2019-01-24 00:57:15.106 default/stage-0/default-step-0-0: [4/501] Generating default-theme with a meson_exe.py custom command.
24-Jan-2019 05:57:15 2019-01-24 00:57:15.261 default/stage-0/default-step-0-0: [5/501] Generating package_revision.h with a custom command.
24-Jan-2019 05:57:15 2019-01-24 00:57:15.519 default/stage-0/default-step-0-0: [6/501] Generating enums.h with a meson_exe.py custom command.
24-Jan-2019 05:57:15 2019-01-24 00:57:15.781 default/stage-0/default-step-0-0: [7/501] Compiling C object 'libpurple/libpurple@@purple@sha/attention.c.o'.
24-Jan-2019 05:57:15 2019-01-24 00:57:15.782 default/stage-0/default-step-0-0: FAILED: libpurple/libpurple@@purple@sha/attention.c.o
24-Jan-2019 05:57:15 2019-01-24 00:57:15.782 default/stage-0/default-step-0-0: cc -Ilibpurple/libpurple@@purple@sha -Ilibpurple -I../libpurple -I. -I../ -I/usr/include/glib-2.0 -I/usr/lib/x86_64-linux-gnu/glib-2.0/include -I/usr/include/gplugin-1.0 -I/usr/include/libxml2 -I/usr/include/farstream-0.2 -I/usr/include/gstreamer-1.0 -I/usr/include/orc-0.4 -I/usr/include/json-glib-1.0 -fdiagnostics-color=always -pipe -D_FILE_OFFSET_BITS=64 -Wall -Winvalid-pch -O0 -g -DHAVE_CONFIG_H=1 -DPURPLE_DISABLE_DEPRECATED -DPIDGIN_DISABLE_DEPRECATED -DFINCH_DISABLE_DEPRECATED -DGNT_DISABLE_DEPRECATED -Waggregate-return -Wcast-align -Wdeclaration-after-statement -Wendif-labels -Werror-implicit-function-declaration -Wformat -Wformat-security -Winit-self -Wmissing-declarations -Wmissing-noreturn -Wmissing-prototypes -Wpointer-arith -Wfloat-equal -Wundef -fPIC -pthread  -MD -MQ 'libpurple/libpurple@@purple@sha/attention.c.o' -MF 'libpurple/libpurple@@purple@sha/attention.c.o.d' -o 'libpurple/libpurple@@purple@sha/attention.c.o' -c ../libpurple/attention.c
24-Jan-2019 05:57:15 2019-01-24 00:57:15.782 default/stage-0/default-step-0-0: In file included from ../libpurple/protocol.h:53,
24-Jan-2019 05:57:15 2019-01-24 00:57:15.782 default/stage-0/default-step-0-0:                  from ../libpurple/connection.h:207,
24-Jan-2019 05:57:15 2019-01-24 00:57:15.782 default/stage-0/default-step-0-0:                  from ../libpurple/account.h:53,
24-Jan-2019 05:57:15 2019-01-24 00:57:15.782 default/stage-0/default-step-0-0:                  from ../libpurple/attention.h:58,
24-Jan-2019 05:57:15 2019-01-24 00:57:15.782 default/stage-0/default-step-0-0:                  from ../libpurple/attention.c:22:
24-Jan-2019 05:57:15 2019-01-24 00:57:15.782 default/stage-0/default-step-0-0: ../libpurple/plugins.h:54:9: error: unknown type name ?GPluginPluginInterface?
24-Jan-2019 05:57:15 2019-01-24 00:57:15.782 default/stage-0/default-step-0-0: typedef GPluginPluginInterface PurplePluginInterface;
24-Jan-2019 05:57:15 2019-01-24 00:57:15.782 default/stage-0/default-step-0-0:          ^~~~~~~~~~~~~~~~~~~~~~
24-Jan-2019 05:57:15 2019-01-24 00:57:15.819 default/stage-0/default-step-0-0: [8/501] Compiling C object 'libpurple/libpurple@@purple@sha/accounts.c.o'.
24-Jan-2019 05:57:15 2019-01-24 00:57:15.819 default/stage-0/default-step-0-0: FAILED: libpurple/libpurple@@purple@sha/accounts.c.o
24-Jan-2019 05:57:15 2019-01-24 00:57:15.819 default/stage-0/default-step-0-0: cc -Ilibpurple/libpurple@@purple@sha -Ilibpurple -I../libpurple -I. -I../ -I/usr/include/glib-2.0 -I/usr/lib/x86_64-linux-gnu/glib-2.0/include -I/usr/include/gplugin-1.0 -I/usr/include/libxml2 -I/usr/include/farstream-0.2 -I/usr/include/gstreamer-1.0 -I/usr/include/orc-0.4 -I/usr/include/json-glib-1.0 -fdiagnostics-color=always -pipe -D_FILE_OFFSET_BITS=64 -Wall -Winvalid-pch -O0 -g -DHAVE_CONFIG_H=1 -DPURPLE_DISABLE_DEPRECATED -DPIDGIN_DISABLE_DEPRECATED -DFINCH_DISABLE_DEPRECATED -DGNT_DISABLE_DEPRECATED -Waggregate-return -Wcast-align -Wdeclaration-after-statement -Wendif-labels -Werror-implicit-function-declaration -Wformat -Wformat-security -Winit-self -Wmissing-declarations -Wmissing-noreturn -Wmissing-prototypes -Wpointer-arith -Wfloat-equal -Wundef -fPIC -pthread  -MD -MQ 'libpurple/libpurple@@purple@sha/accounts.c.o' -MF 'libpurple/libpurple@@purple@sha/accounts.c.o.d' -o 'libpurple/libpurple@@purple@sha/accounts.c.o' -c ../libpurple/accounts.c
24-Jan-2019 05:57:15 2019-01-24 00:57:15.819 default/stage-0/default-step-0-0: In file included from ../libpurple/protocol.h:53,
24-Jan-2019 05:57:15 2019-01-24 00:57:15.819 default/stage-0/default-step-0-0:                  from ../libpurple/connection.h:207,
24-Jan-2019 05:57:15 2019-01-24 00:57:15.819 default/stage-0/default-step-0-0:                  from ../libpurple/account.h:53,
24-Jan-2019 05:57:15 2019-01-24 00:57:15.819 default/stage-0/default-step-0-0:                  from ../libpurple/accounts.h:32,
24-Jan-2019 05:57:15 2019-01-24 00:57:15.819 default/stage-0/default-step-0-0:                  from ../libpurple/internal.h:158,
24-Jan-2019 05:57:15 2019-01-24 00:57:15.819 default/stage-0/default-step-0-0:                  from ../libpurple/accounts.c:21:
24-Jan-2019 05:57:15 2019-01-24 00:57:15.819 default/stage-0/default-step-0-0: ../libpurple/plugins.h:54:9: error: unknown type name ?GPluginPluginInterface?
24-Jan-2019 05:57:15 2019-01-24 00:57:15.819 default/stage-0/default-step-0-0: typedef GPluginPluginInterface PurplePluginInterface;
24-Jan-2019 05:57:15 2019-01-24 00:57:15.819 default/stage-0/default-step-0-0:          ^~~~~~~~~~~~~~~~~~~~~~
24-Jan-2019 05:57:15 2019-01-24 00:57:15.820 default/stage-0/default-step-0-0: [9/501] Compiling C object 'libpurple/libpurple@@purple@sha/blistnode.c.o'.
24-Jan-2019 05:57:15 2019-01-24 00:57:15.820 default/stage-0/default-step-0-0: FAILED: libpurple/libpurple@@purple@sha/blistnode.c.o
24-Jan-2019 05:57:15 2019-01-24 00:57:15.820 default/stage-0/default-step-0-0: cc -Ilibpurple/libpurple@@purple@sha -Ilibpurple -I../libpurple -I. -I../ -I/usr/include/glib-2.0 -I/usr/lib/x86_64-linux-gnu/glib-2.0/include -I/usr/include/gplugin-1.0 -I/usr/include/libxml2 -I/usr/include/farstream-0.2 -I/usr/include/gstreamer-1.0 -I/usr/include/orc-0.4 -I/usr/include/json-glib-1.0 -fdiagnostics-color=always -pipe -D_FILE_OFFSET_BITS=64 -Wall -Winvalid-pch -O0 -g -DHAVE_CONFIG_H=1 -DPURPLE_DISABLE_DEPRECATED -DPIDGIN_DISABLE_DEPRECATED -DFINCH_DISABLE_DEPRECATED -DGNT_DISABLE_DEPRECATED -Waggregate-return -Wcast-align -Wdeclaration-after-statement -Wendif-labels -Werror-implicit-function-declaration -Wformat -Wformat-security -Winit-self -Wmissing-declarations -Wmissing-noreturn -Wmissing-prototypes -Wpointer-arith -Wfloat-equal -Wundef -fPIC -pthread  -MD -MQ 'libpurple/libpurple@@purple@sha/blistnode.c.o' -MF 'libpurple/libpurple@@purple@sha/blistnode.c.o.d' -o 'libpurple/libpurple@@purple@sha/blistnode.c.o' -c ../libpurple/blistnode.c
24-Jan-2019 05:57:15 2019-01-24 00:57:15.820 default/stage-0/default-step-0-0: In file included from ../libpurple/protocol.h:53,
24-Jan-2019 05:57:15 2019-01-24 00:57:15.820 default/stage-0/default-step-0-0:                  from ../libpurple/connection.h:207,
24-Jan-2019 05:57:15 2019-01-24 00:57:15.820 default/stage-0/default-step-0-0:                  from ../libpurple/account.h:53,
24-Jan-2019 05:57:15 2019-01-24 00:57:15.820 default/stage-0/default-step-0-0:                  from ../libpurple/accounts.h:32,
24-Jan-2019 05:57:15 2019-01-24 00:57:15.820 default/stage-0/default-step-0-0:                  from ../libpurple/internal.h:158,
24-Jan-2019 05:57:15 2019-01-24 00:57:15.820 default/stage-0/default-step-0-0:                  from ../libpurple/blistnode.c:23:
24-Jan-2019 05:57:15 2019-01-24 00:57:15.820 default/stage-0/default-step-0-0: ../libpurple/plugins.h:54:9: error: unknown type name ?GPluginPluginInterface?
24-Jan-2019 05:57:15 2019-01-24 00:57:15.820 default/stage-0/default-step-0-0: typedef GPluginPluginInterface PurplePluginInterface;
24-Jan-2019 05:57:15 2019-01-24 00:57:15.820 default/stage-0/default-step-0-0:          ^~~~~~~~~~~~~~~~~~~~~~
24-Jan-2019 05:57:15 2019-01-24 00:57:15.823 default/stage-0/default-step-0-0: [10/501] Compiling C object 'libpurple/libpurple@@purple@sha/chat.c.o'.
24-Jan-2019 05:57:15 2019-01-24 00:57:15.824 default/stage-0/default-step-0-0: FAILED: libpurple/libpurple@@purple@sha/chat.c.o
24-Jan-2019 05:57:15 2019-01-24 00:57:15.824 default/stage-0/default-step-0-0: cc -Ilibpurple/libpurple@@purple@sha -Ilibpurple -I../libpurple -I. -I../ -I/usr/include/glib-2.0 -I/usr/lib/x86_64-linux-gnu/glib-2.0/include -I/usr/include/gplugin-1.0 -I/usr/include/libxml2 -I/usr/include/farstream-0.2 -I/usr/include/gstreamer-1.0 -I/usr/include/orc-0.4 -I/usr/include/json-glib-1.0 -fdiagnostics-color=always -pipe -D_FILE_OFFSET_BITS=64 -Wall -Winvalid-pch -O0 -g -DHAVE_CONFIG_H=1 -DPURPLE_DISABLE_DEPRECATED -DPIDGIN_DISABLE_DEPRECATED -DFINCH_DISABLE_DEPRECATED -DGNT_DISABLE_DEPRECATED -Waggregate-return -Wcast-align -Wdeclaration-after-statement -Wendif-labels -Werror-implicit-function-declaration -Wformat -Wformat-security -Winit-self -Wmissing-declarations -Wmissing-noreturn -Wmissing-prototypes -Wpointer-arith -Wfloat-equal -Wundef -fPIC -pthread  -MD -MQ 'libpurple/libpurple@@purple@sha/chat.c.o' -MF 'libpurple/libpurple@@purple@sha/chat.c.o.d' -o 'libpurple/libpurple@@purple@sha/chat.c.o' -c ../libpurple/chat.c
24-Jan-2019 05:57:15 2019-01-24 00:57:15.824 default/stage-0/default-step-0-0: In file included from ../libpurple/protocol.h:53,
24-Jan-2019 05:57:15 2019-01-24 00:57:15.824 default/stage-0/default-step-0-0:                  from ../libpurple/connection.h:207,
24-Jan-2019 05:57:15 2019-01-24 00:57:15.824 default/stage-0/default-step-0-0:                  from ../libpurple/account.h:53,
24-Jan-2019 05:57:15 2019-01-24 00:57:15.824 default/stage-0/default-step-0-0:                  from ../libpurple/accounts.h:32,
24-Jan-2019 05:57:15 2019-01-24 00:57:15.824 default/stage-0/default-step-0-0:                  from ../libpurple/internal.h:158,
24-Jan-2019 05:57:15 2019-01-24 00:57:15.824 default/stage-0/default-step-0-0:                  from ../libpurple/chat.c:23:
24-Jan-2019 05:57:15 2019-01-24 00:57:15.824 default/stage-0/default-step-0-0: ../libpurple/plugins.h:54:9: error: unknown type name ?GPluginPluginInterface?
24-Jan-2019 05:57:15 2019-01-24 00:57:15.824 default/stage-0/default-step-0-0: typedef GPluginPluginInterface PurplePluginInterface;
24-Jan-2019 05:57:15 2019-01-24 00:57:15.824 default/stage-0/default-step-0-0:          ^~~~~~~~~~~~~~~~~~~~~~
24-Jan-2019 05:57:15 2019-01-24 00:57:15.825 default/stage-0/default-step-0-0: [11/501] Compiling C object 'libpurple/libpurple@@purple@sha/circularbuffer.c.o'.
24-Jan-2019 05:57:15 2019-01-24 00:57:15.825 default/stage-0/default-step-0-0: FAILED: libpurple/libpurple@@purple@sha/circularbuffer.c.o
24-Jan-2019 05:57:15 2019-01-24 00:57:15.825 default/stage-0/default-step-0-0: cc -Ilibpurple/libpurple@@purple@sha -Ilibpurple -I../libpurple -I. -I../ -I/usr/include/glib-2.0 -I/usr/lib/x86_64-linux-gnu/glib-2.0/include -I/usr/include/gplugin-1.0 -I/usr/include/libxml2 -I/usr/include/farstream-0.2 -I/usr/include/gstreamer-1.0 -I/usr/include/orc-0.4 -I/usr/include/json-glib-1.0 -fdiagnostics-color=always -pipe -D_FILE_OFFSET_BITS=64 -Wall -Winvalid-pch -O0 -g -DHAVE_CONFIG_H=1 -DPURPLE_DISABLE_DEPRECATED -DPIDGIN_DISABLE_DEPRECATED -DFINCH_DISABLE_DEPRECATED -DGNT_DISABLE_DEPRECATED -Waggregate-return -Wcast-align -Wdeclaration-after-statement -Wendif-labels -Werror-implicit-function-declaration -Wformat -Wformat-security -Winit-self -Wmissing-declarations -Wmissing-noreturn -Wmissing-prototypes -Wpointer-arith -Wfloat-equal -Wundef -fPIC -pthread  -MD -MQ 'libpurple/libpurple@@purple@sha/circularbuffer.c.o' -MF 'libpurple/libpurple@@purple@sha/circularbuffer.c.o.d' -o 'libpurple/libpurple@@purple@sha/circularbuffer.c.o' -c ../libpurple/circularbuffer.c
24-Jan-2019 05:57:15 2019-01-24 00:57:15.825 default/stage-0/default-step-0-0: In file included from ../libpurple/protocol.h:53,
24-Jan-2019 05:57:15 2019-01-24 00:57:15.825 default/stage-0/default-step-0-0:                  from ../libpurple/connection.h:207,
24-Jan-2019 05:57:15 2019-01-24 00:57:15.825 default/stage-0/default-step-0-0:                  from ../libpurple/account.h:53,
24-Jan-2019 05:57:15 2019-01-24 00:57:15.825 default/stage-0/default-step-0-0:                  from ../libpurple/accounts.h:32,
24-Jan-2019 05:57:15 2019-01-24 00:57:15.825 default/stage-0/default-step-0-0:                  from ../libpurple/internal.h:158,
24-Jan-2019 05:57:15 2019-01-24 00:57:15.825 default/stage-0/default-step-0-0:                  from ../libpurple/circularbuffer.c:19:
24-Jan-2019 05:57:15 2019-01-24 00:57:15.825 default/stage-0/default-step-0-0: ../libpurple/plugins.h:54:9: error: unknown type name ?GPluginPluginInterface?
24-Jan-2019 05:57:15 2019-01-24 00:57:15.825 default/stage-0/default-step-0-0: typedef GPluginPluginInterface PurplePluginInterface;
24-Jan-2019 05:57:15 2019-01-24 00:57:15.825 default/stage-0/default-step-0-0:          ^~~~~~~~~~~~~~~~~~~~~~
24-Jan-2019 05:57:15 2019-01-24 00:57:15.826 default/stage-0/default-step-0-0: [12/501] Compiling C object 'libpurple/libpurple@@purple@sha/accountopt.c.o'.
24-Jan-2019 05:57:15 2019-01-24 00:57:15.826 default/stage-0/default-step-0-0: FAILED: libpurple/libpurple@@purple@sha/accountopt.c.o
24-Jan-2019 05:57:15 2019-01-24 00:57:15.826 default/stage-0/default-step-0-0: cc -Ilibpurple/libpurple@@purple@sha -Ilibpurple -I../libpurple -I. -I../ -I/usr/include/glib-2.0 -I/usr/lib/x86_64-linux-gnu/glib-2.0/include -I/usr/include/gplugin-1.0 -I/usr/include/libxml2 -I/usr/include/farstream-0.2 -I/usr/include/gstreamer-1.0 -I/usr/include/orc-0.4 -I/usr/include/json-glib-1.0 -fdiagnostics-color=always -pipe -D_FILE_OFFSET_BITS=64 -Wall -Winvalid-pch -O0 -g -DHAVE_CONFIG_H=1 -DPURPLE_DISABLE_DEPRECATED -DPIDGIN_DISABLE_DEPRECATED -DFINCH_DISABLE_DEPRECATED -DGNT_DISABLE_DEPRECATED -Waggregate-return -Wcast-align -Wdeclaration-after-statement -Wendif-labels -Werror-implicit-function-declaration -Wformat -Wformat-security -Winit-self -Wmissing-declarations -Wmissing-noreturn -Wmissing-prototypes -Wpointer-arith -Wfloat-equal -Wundef -fPIC -pthread  -MD -MQ 'libpurple/libpurple@@purple@sha/accountopt.c.o' -MF 'libpurple/libpurple@@purple@sha/accountopt.c.o.d' -o 'libpurple/libpurple@@purple@sha/accountopt.c.o' -c ../libpurple/accountopt.c
24-Jan-2019 05:57:15 2019-01-24 00:57:15.826 default/stage-0/default-step-0-0: In file included from ../libpurple/protocol.h:53,
24-Jan-2019 05:57:15 2019-01-24 00:57:15.826 default/stage-0/default-step-0-0:                  from ../libpurple/connection.h:207,
24-Jan-2019 05:57:15 2019-01-24 00:57:15.826 default/stage-0/default-step-0-0:                  from ../libpurple/account.h:53,
24-Jan-2019 05:57:15 2019-01-24 00:57:15.826 default/stage-0/default-step-0-0:                  from ../libpurple/accounts.h:32,
24-Jan-2019 05:57:15 2019-01-24 00:57:15.826 default/stage-0/default-step-0-0:                  from ../libpurple/internal.h:158,
24-Jan-2019 05:57:15 2019-01-24 00:57:15.826 default/stage-0/default-step-0-0:                  from ../libpurple/accountopt.c:21:
24-Jan-2019 05:57:15 2019-01-24 00:57:15.826 default/stage-0/default-step-0-0: ../libpurple/plugins.h:54:9: error: unknown type name ?GPluginPluginInterface?
24-Jan-2019 05:57:15 2019-01-24 00:57:15.826 default/stage-0/default-step-0-0: typedef GPluginPluginInterface PurplePluginInterface;
24-Jan-2019 05:57:15 2019-01-24 00:57:15.826 default/stage-0/default-step-0-0:          ^~~~~~~~~~~~~~~~~~~~~~
24-Jan-2019 05:57:15 2019-01-24 00:57:15.835 default/stage-0/default-step-0-0: [13/501] Compiling C object 'libpurple/libpurple@@purple@sha/buddyicon.c.o'.
24-Jan-2019 05:57:15 2019-01-24 00:57:15.835 default/stage-0/default-step-0-0: FAILED: libpurple/libpurple@@purple@sha/buddyicon.c.o
24-Jan-2019 05:57:15 2019-01-24 00:57:15.835 default/stage-0/default-step-0-0: cc -Ilibpurple/libpurple@@purple@sha -Ilibpurple -I../libpurple -I. -I../ -I/usr/include/glib-2.0 -I/usr/lib/x86_64-linux-gnu/glib-2.0/include -I/usr/include/gplugin-1.0 -I/usr/include/libxml2 -I/usr/include/farstream-0.2 -I/usr/include/gstreamer-1.0 -I/usr/include/orc-0.4 -I/usr/include/json-glib-1.0 -fdiagnostics-color=always -pipe -D_FILE_OFFSET_BITS=64 -Wall -Winvalid-pch -O0 -g -DHAVE_CONFIG_H=1 -DPURPLE_DISABLE_DEPRECATED -DPIDGIN_DISABLE_DEPRECATED -DFINCH_DISABLE_DEPRECATED -DGNT_DISABLE_DEPRECATED -Waggregate-return -Wcast-align -Wdeclaration-after-statement -Wendif-labels -Werror-implicit-function-declaration -Wformat -Wformat-security -Winit-self -Wmissing-declarations -Wmissing-noreturn -Wmissing-prototypes -Wpointer-arith -Wfloat-equal -Wundef -fPIC -pthread  -MD -MQ 'libpurple/libpurple@@purple@sha/buddyicon.c.o' -MF 'libpurple/libpurple@@purple@sha/buddyicon.c.o.d' -o 'libpurple/libpurple@@purple@sha/buddyicon.c.o' -c ../libpurple/buddyicon.c
24-Jan-2019 05:57:15 2019-01-24 00:57:15.835 default/stage-0/default-step-0-0: In file included from ../libpurple/protocol.h:53,
24-Jan-2019 05:57:15 2019-01-24 00:57:15.835 default/stage-0/default-step-0-0:                  from ../libpurple/connection.h:207,
24-Jan-2019 05:57:15 2019-01-24 00:57:15.835 default/stage-0/default-step-0-0:                  from ../libpurple/account.h:53,
24-Jan-2019 05:57:15 2019-01-24 00:57:15.835 default/stage-0/default-step-0-0:                  from ../libpurple/accounts.h:32,
24-Jan-2019 05:57:15 2019-01-24 00:57:15.835 default/stage-0/default-step-0-0:                  from ../libpurple/internal.h:158,
24-Jan-2019 05:57:15 2019-01-24 00:57:15.835 default/stage-0/default-step-0-0:                  from ../libpurple/buddyicon.c:23:
24-Jan-2019 05:57:15 2019-01-24 00:57:15.835 default/stage-0/default-step-0-0: ../libpurple/plugins.h:54:9: error: unknown type name ?GPluginPluginInterface?
24-Jan-2019 05:57:15 2019-01-24 00:57:15.835 default/stage-0/default-step-0-0: typedef GPluginPluginInterface PurplePluginInterface;
24-Jan-2019 05:57:15 2019-01-24 00:57:15.835 default/stage-0/default-step-0-0:          ^~~~~~~~~~~~~~~~~~~~~~
24-Jan-2019 05:57:15 2019-01-24 00:57:15.862 default/stage-0/default-step-0-0: [14/501] Compiling C object 'libpurple/libpurple@@purple@sha/buddylist.c.o'.
24-Jan-2019 05:57:15 2019-01-24 00:57:15.862 default/stage-0/default-step-0-0: FAILED: libpurple/libpurple@@purple@sha/buddylist.c.o
24-Jan-2019 05:57:15 2019-01-24 00:57:15.862 default/stage-0/default-step-0-0: cc -Ilibpurple/libpurple@@purple@sha -Ilibpurple -I../libpurple -I. -I../ -I/usr/include/glib-2.0 -I/usr/lib/x86_64-linux-gnu/glib-2.0/include -I/usr/include/gplugin-1.0 -I/usr/include/libxml2 -I/usr/include/farstream-0.2 -I/usr/include/gstreamer-1.0 -I/usr/include/orc-0.4 -I/usr/include/json-glib-1.0 -fdiagnostics-color=always -pipe -D_FILE_OFFSET_BITS=64 -Wall -Winvalid-pch -O0 -g -DHAVE_CONFIG_H=1 -DPURPLE_DISABLE_DEPRECATED -DPIDGIN_DISABLE_DEPRECATED -DFINCH_DISABLE_DEPRECATED -DGNT_DISABLE_DEPRECATED -Waggregate-return -Wcast-align -Wdeclaration-after-statement -Wendif-labels -Werror-implicit-function-declaration -Wformat -Wformat-security -Winit-self -Wmissing-declarations -Wmissing-noreturn -Wmissing-prototypes -Wpointer-arith -Wfloat-equal -Wundef -fPIC -pthread  -MD -MQ 'libpurple/libpurple@@purple@sha/buddylist.c.o' -MF 'libpurple/libpurple@@purple@sha/buddylist.c.o.d' -o 'libpurple/libpurple@@purple@sha/buddylist.c.o' -c ../libpurple/buddylist.c
24-Jan-2019 05:57:15 2019-01-24 00:57:15.862 default/stage-0/default-step-0-0: In file included from ../libpurple/protocol.h:53,
24-Jan-2019 05:57:15 2019-01-24 00:57:15.862 default/stage-0/default-step-0-0:                  from ../libpurple/connection.h:207,
24-Jan-2019 05:57:15 2019-01-24 00:57:15.862 default/stage-0/default-step-0-0:                  from ../libpurple/account.h:53,
24-Jan-2019 05:57:15 2019-01-24 00:57:15.862 default/stage-0/default-step-0-0:                  from ../libpurple/accounts.h:32,
24-Jan-2019 05:57:15 2019-01-24 00:57:15.862 default/stage-0/default-step-0-0:                  from ../libpurple/internal.h:158,
24-Jan-2019 05:57:15 2019-01-24 00:57:15.862 default/stage-0/default-step-0-0:                  from ../libpurple/buddylist.c:23:
24-Jan-2019 05:57:15 2019-01-24 00:57:15.862 default/stage-0/default-step-0-0: ../libpurple/plugins.h:54:9: error: unknown type name ?GPluginPluginInterface?
24-Jan-2019 05:57:15 2019-01-24 00:57:15.862 default/stage-0/default-step-0-0: typedef GPluginPluginInterface PurplePluginInterface;
24-Jan-2019 05:57:15 2019-01-24 00:57:15.862 default/stage-0/default-step-0-0:          ^~~~~~~~~~~~~~~~~~~~~~
24-Jan-2019 05:57:15 2019-01-24 00:57:15.864 default/stage-0/default-step-0-0: [15/501] Compiling C object 'libpurple/libpurple@@purple@sha/conversation.c.o'.
24-Jan-2019 05:57:15 2019-01-24 00:57:15.864 default/stage-0/default-step-0-0: FAILED: libpurple/libpurple@@purple@sha/conversation.c.o
24-Jan-2019 05:57:15 2019-01-24 00:57:15.864 default/stage-0/default-step-0-0: cc -Ilibpurple/libpurple@@purple@sha -Ilibpurple -I../libpurple -I. -I../ -I/usr/include/glib-2.0 -I/usr/lib/x86_64-linux-gnu/glib-2.0/include -I/usr/include/gplugin-1.0 -I/usr/include/libxml2 -I/usr/include/farstream-0.2 -I/usr/include/gstreamer-1.0 -I/usr/include/orc-0.4 -I/usr/include/json-glib-1.0 -fdiagnostics-color=always -pipe -D_FILE_OFFSET_BITS=64 -Wall -Winvalid-pch -O0 -g -DHAVE_CONFIG_H=1 -DPURPLE_DISABLE_DEPRECATED -DPIDGIN_DISABLE_DEPRECATED -DFINCH_DISABLE_DEPRECATED -DGNT_DISABLE_DEPRECATED -Waggregate-return -Wcast-align -Wdeclaration-after-statement -Wendif-labels -Werror-implicit-function-declaration -Wformat -Wformat-security -Winit-self -Wmissing-declarations -Wmissing-noreturn -Wmissing-prototypes -Wpointer-arith -Wfloat-equal -Wundef -fPIC -pthread  -MD -MQ 'libpurple/libpurple@@purple@sha/conversation.c.o' -MF 'libpurple/libpurple@@purple@sha/conversation.c.o.d' -o 'libpurple/libpurple@@purple@sha/conversation.c.o' -c ../libpurple/conversation.c
24-Jan-2019 05:57:15 2019-01-24 00:57:15.864 default/stage-0/default-step-0-0: In file included from ../libpurple/protocol.h:53,
24-Jan-2019 05:57:15 2019-01-24 00:57:15.864 default/stage-0/default-step-0-0:                  from ../libpurple/connection.h:207,
24-Jan-2019 05:57:15 2019-01-24 00:57:15.864 default/stage-0/default-step-0-0:                  from ../libpurple/account.h:53,
24-Jan-2019 05:57:15 2019-01-24 00:57:15.864 default/stage-0/default-step-0-0:                  from ../libpurple/accounts.h:32,
24-Jan-2019 05:57:15 2019-01-24 00:57:15.864 default/stage-0/default-step-0-0:                  from ../libpurple/internal.h:158,
24-Jan-2019 05:57:15 2019-01-24 00:57:15.864 default/stage-0/default-step-0-0:                  from ../libpurple/conversation.c:22:
24-Jan-2019 05:57:15 2019-01-24 00:57:15.864 default/stage-0/default-step-0-0: ../libpurple/plugins.h:54:9: error: unknown type name ?GPluginPluginInterface?
24-Jan-2019 05:57:15 2019-01-24 00:57:15.864 default/stage-0/default-step-0-0: typedef GPluginPluginInterface PurplePluginInterface;
24-Jan-2019 05:57:15 2019-01-24 00:57:15.864 default/stage-0/default-step-0-0:          ^~~~~~~~~~~~~~~~~~~~~~
24-Jan-2019 05:57:15 2019-01-24 00:57:15.890 default/stage-0/default-step-0-0: [16/501] Compiling C object 'libpurple/libpurple@@purple@sha/account.c.o'.
24-Jan-2019 05:57:15 2019-01-24 00:57:15.890 default/stage-0/default-step-0-0: FAILED: libpurple/libpurple@@purple@sha/account.c.o
24-Jan-2019 05:57:15 2019-01-24 00:57:15.890 default/stage-0/default-step-0-0: cc -Ilibpurple/libpurple@@purple@sha -Ilibpurple -I../libpurple -I. -I../ -I/usr/include/glib-2.0 -I/usr/lib/x86_64-linux-gnu/glib-2.0/include -I/usr/include/gplugin-1.0 -I/usr/include/libxml2 -I/usr/include/farstream-0.2 -I/usr/include/gstreamer-1.0 -I/usr/include/orc-0.4 -I/usr/include/json-glib-1.0 -fdiagnostics-color=always -pipe -D_FILE_OFFSET_BITS=64 -Wall -Winvalid-pch -O0 -g -DHAVE_CONFIG_H=1 -DPURPLE_DISABLE_DEPRECATED -DPIDGIN_DISABLE_DEPRECATED -DFINCH_DISABLE_DEPRECATED -DGNT_DISABLE_DEPRECATED -Waggregate-return -Wcast-align -Wdeclaration-after-statement -Wendif-labels -Werror-implicit-function-declaration -Wformat -Wformat-security -Winit-self -Wmissing-declarations -Wmissing-noreturn -Wmissing-prototypes -Wpointer-arith -Wfloat-equal -Wundef -fPIC -pthread  -MD -MQ 'libpurple/libpurple@@purple@sha/account.c.o' -MF 'libpurple/libpurple@@purple@sha/account.c.o.d' -o 'libpurple/libpurple@@purple@sha/account.c.o' -c ../libpurple/account.c
24-Jan-2019 05:57:15 2019-01-24 00:57:15.890 default/stage-0/default-step-0-0: In file included from ../libpurple/protocol.h:53,
24-Jan-2019 05:57:15 2019-01-24 00:57:15.890 default/stage-0/default-step-0-0:                  from ../libpurple/connection.h:207,
24-Jan-2019 05:57:15 2019-01-24 00:57:15.890 default/stage-0/default-step-0-0:                  from ../libpurple/account.h:53,
24-Jan-2019 05:57:15 2019-01-24 00:57:15.890 default/stage-0/default-step-0-0:                  from ../libpurple/accounts.h:32,
24-Jan-2019 05:57:15 2019-01-24 00:57:15.890 default/stage-0/default-step-0-0:                  from ../libpurple/internal.h:158,
24-Jan-2019 05:57:15 2019-01-24 00:57:15.890 default/stage-0/default-step-0-0:                  from ../libpurple/account.c:21:
24-Jan-2019 05:57:15 2019-01-24 00:57:15.890 default/stage-0/default-step-0-0: ../libpurple/plugins.h:54:9: error: unknown type name ?GPluginPluginInterface?
24-Jan-2019 05:57:15 2019-01-24 00:57:15.890 default/stage-0/default-step-0-0: typedef GPluginPluginInterface PurplePluginInterface;
24-Jan-2019 05:57:15 2019-01-24 00:57:15.890 default/stage-0/default-step-0-0:          ^~~~~~~~~~~~~~~~~~~~~~
24-Jan-2019 05:57:15 2019-01-24 00:57:15.891 default/stage-0/default-step-0-0: [17/501] Compiling C object 'libpurple/libpurple@@purple@sha/buddy.c.o'.
24-Jan-2019 05:57:15 2019-01-24 00:57:15.891 default/stage-0/default-step-0-0: FAILED: libpurple/libpurple@@purple@sha/buddy.c.o
24-Jan-2019 05:57:15 2019-01-24 00:57:15.891 default/stage-0/default-step-0-0: cc -Ilibpurple/libpurple@@purple@sha -Ilibpurple -I../libpurple -I. -I../ -I/usr/include/glib-2.0 -I/usr/lib/x86_64-linux-gnu/glib-2.0/include -I/usr/include/gplugin-1.0 -I/usr/include/libxml2 -I/usr/include/farstream-0.2 -I/usr/include/gstreamer-1.0 -I/usr/include/orc-0.4 -I/usr/include/json-glib-1.0 -fdiagnostics-color=always -pipe -D_FILE_OFFSET_BITS=64 -Wall -Winvalid-pch -O0 -g -DHAVE_CONFIG_H=1 -DPURPLE_DISABLE_DEPRECATED -DPIDGIN_DISABLE_DEPRECATED -DFINCH_DISABLE_DEPRECATED -DGNT_DISABLE_DEPRECATED -Waggregate-return -Wcast-align -Wdeclaration-after-statement -Wendif-labels -Werror-implicit-function-declaration -Wformat -Wformat-security -Winit-self -Wmissing-declarations -Wmissing-noreturn -Wmissing-prototypes -Wpointer-arith -Wfloat-equal -Wundef -fPIC -pthread  -MD -MQ 'libpurple/libpurple@@purple@sha/buddy.c.o' -MF 'libpurple/libpurple@@purple@sha/buddy.c.o.d' -o 'libpurple/libpurple@@purple@sha/buddy.c.o' -c ../libpurple/buddy.c
24-Jan-2019 05:57:15 2019-01-24 00:57:15.891 default/stage-0/default-step-0-0: In file included from ../libpurple/protocol.h:53,
24-Jan-2019 05:57:15 2019-01-24 00:57:15.891 default/stage-0/default-step-0-0:                  from ../libpurple/connection.h:207,
24-Jan-2019 05:57:15 2019-01-24 00:57:15.891 default/stage-0/default-step-0-0:                  from ../libpurple/account.h:53,
24-Jan-2019 05:57:15 2019-01-24 00:57:15.891 default/stage-0/default-step-0-0:                  from ../libpurple/accounts.h:32,
24-Jan-2019 05:57:15 2019-01-24 00:57:15.891 default/stage-0/default-step-0-0:                  from ../libpurple/internal.h:158,
24-Jan-2019 05:57:15 2019-01-24 00:57:15.891 default/stage-0/default-step-0-0:                  from ../libpurple/buddy.c:23:
24-Jan-2019 05:57:15 2019-01-24 00:57:15.891 default/stage-0/default-step-0-0: ../libpurple/plugins.h:54:9: error: unknown type name ?GPluginPluginInterface?
24-Jan-2019 05:57:15 2019-01-24 00:57:15.891 default/stage-0/default-step-0-0: typedef GPluginPluginInterface PurplePluginInterface;
24-Jan-2019 05:57:15 2019-01-24 00:57:15.891 default/stage-0/default-step-0-0:          ^~~~~~~~~~~~~~~~~~~~~~
24-Jan-2019 05:57:15 2019-01-24 00:57:15.892 default/stage-0/default-step-0-0: [18/501] Compiling C object 'libpurple/libpurple@@purple@sha/connection.c.o'.
24-Jan-2019 05:57:15 2019-01-24 00:57:15.892 default/stage-0/default-step-0-0: FAILED: libpurple/libpurple@@purple@sha/connection.c.o
24-Jan-2019 05:57:15 2019-01-24 00:57:15.892 default/stage-0/default-step-0-0: cc -Ilibpurple/libpurple@@purple@sha -Ilibpurple -I../libpurple -I. -I../ -I/usr/include/glib-2.0 -I/usr/lib/x86_64-linux-gnu/glib-2.0/include -I/usr/include/gplugin-1.0 -I/usr/include/libxml2 -I/usr/include/farstream-0.2 -I/usr/include/gstreamer-1.0 -I/usr/include/orc-0.4 -I/usr/include/json-glib-1.0 -fdiagnostics-color=always -pipe -D_FILE_OFFSET_BITS=64 -Wall -Winvalid-pch -O0 -g -DHAVE_CONFIG_H=1 -DPURPLE_DISABLE_DEPRECATED -DPIDGIN_DISABLE_DEPRECATED -DFINCH_DISABLE_DEPRECATED -DGNT_DISABLE_DEPRECATED -Waggregate-return -Wcast-align -Wdeclaration-after-statement -Wendif-labels -Werror-implicit-function-declaration -Wformat -Wformat-security -Winit-self -Wmissing-declarations -Wmissing-noreturn -Wmissing-prototypes -Wpointer-arith -Wfloat-equal -Wundef -fPIC -pthread  -MD -MQ 'libpurple/libpurple@@purple@sha/connection.c.o' -MF 'libpurple/libpurple@@purple@sha/connection.c.o.d' -o 'libpurple/libpurple@@purple@sha/connection.c.o' -c ../libpurple/connection.c
24-Jan-2019 05:57:15 2019-01-24 00:57:15.892 default/stage-0/default-step-0-0: In file included from ../libpurple/protocol.h:53,
24-Jan-2019 05:57:15 2019-01-24 00:57:15.892 default/stage-0/default-step-0-0:                  from ../libpurple/connection.h:207,
24-Jan-2019 05:57:15 2019-01-24 00:57:15.892 default/stage-0/default-step-0-0:                  from ../libpurple/account.h:53,
24-Jan-2019 05:57:15 2019-01-24 00:57:15.892 default/stage-0/default-step-0-0:                  from ../libpurple/accounts.h:32,
24-Jan-2019 05:57:15 2019-01-24 00:57:15.892 default/stage-0/default-step-0-0:                  from ../libpurple/internal.h:158,
24-Jan-2019 05:57:15 2019-01-24 00:57:15.892 default/stage-0/default-step-0-0:                  from ../libpurple/connection.c:23:
24-Jan-2019 05:57:15 2019-01-24 00:57:15.892 default/stage-0/default-step-0-0: ../libpurple/plugins.h:54:9: error: unknown type name ?GPluginPluginInterface?
24-Jan-2019 05:57:15 2019-01-24 00:57:15.892 default/stage-0/default-step-0-0: typedef GPluginPluginInterface PurplePluginInterface;
24-Jan-2019 05:57:15 2019-01-24 00:57:15.892 default/stage-0/default-step-0-0:          ^~~~~~~~~~~~~~~~~~~~~~
24-Jan-2019 05:57:15 2019-01-24 00:57:15.918 default/stage-0/default-step-0-0: [19/501] Compiling C object 'libpurple/libpurple@@purple@sha/cmds.c.o'.
24-Jan-2019 05:57:15 2019-01-24 00:57:15.918 default/stage-0/default-step-0-0: FAILED: libpurple/libpurple@@purple@sha/cmds.c.o
24-Jan-2019 05:57:15 2019-01-24 00:57:15.918 default/stage-0/default-step-0-0: cc -Ilibpurple/libpurple@@purple@sha -Ilibpurple -I../libpurple -I. -I../ -I/usr/include/glib-2.0 -I/usr/lib/x86_64-linux-gnu/glib-2.0/include -I/usr/include/gplugin-1.0 -I/usr/include/libxml2 -I/usr/include/farstream-0.2 -I/usr/include/gstreamer-1.0 -I/usr/include/orc-0.4 -I/usr/include/json-glib-1.0 -fdiagnostics-color=always -pipe -D_FILE_OFFSET_BITS=64 -Wall -Winvalid-pch -O0 -g -DHAVE_CONFIG_H=1 -DPURPLE_DISABLE_DEPRECATED -DPIDGIN_DISABLE_DEPRECATED -DFINCH_DISABLE_DEPRECATED -DGNT_DISABLE_DEPRECATED -Waggregate-return -Wcast-align -Wdeclaration-after-statement -Wendif-labels -Werror-implicit-function-declaration -Wformat -Wformat-security -Winit-self -Wmissing-declarations -Wmissing-noreturn -Wmissing-prototypes -Wpointer-arith -Wfloat-equal -Wundef -fPIC -pthread  -MD -MQ 'libpurple/libpurple@@purple@sha/cmds.c.o' -MF 'libpurple/libpurple@@purple@sha/cmds.c.o.d' -o 'libpurple/libpurple@@purple@sha/cmds.c.o' -c ../libpurple/cmds.c
24-Jan-2019 05:57:15 2019-01-24 00:57:15.918 default/stage-0/default-step-0-0: In file included from ../libpurple/protocol.h:53,
24-Jan-2019 05:57:15 2019-01-24 00:57:15.918 default/stage-0/default-step-0-0:                  from ../libpurple/connection.h:207,
24-Jan-2019 05:57:15 2019-01-24 00:57:15.918 default/stage-0/default-step-0-0:                  from ../libpurple/account.h:53,
24-Jan-2019 05:57:15 2019-01-24 00:57:15.918 default/stage-0/default-step-0-0:                  from ../libpurple/accounts.h:32,
24-Jan-2019 05:57:15 2019-01-24 00:57:15.918 default/stage-0/default-step-0-0:                  from ../libpurple/internal.h:158,
24-Jan-2019 05:57:15 2019-01-24 00:57:15.918 default/stage-0/default-step-0-0:                  from ../libpurple/cmds.c:19:
24-Jan-2019 05:57:15 2019-01-24 00:57:15.918 default/stage-0/default-step-0-0: ../libpurple/plugins.h:54:9: error: unknown type name ?GPluginPluginInterface?
24-Jan-2019 05:57:15 2019-01-24 00:57:15.918 default/stage-0/default-step-0-0: typedef GPluginPluginInterface PurplePluginInterface;
24-Jan-2019 05:57:15 2019-01-24 00:57:15.918 default/stage-0/default-step-0-0:          ^~~~~~~~~~~~~~~~~~~~~~
24-Jan-2019 05:57:15 2019-01-24 00:57:15.957 default/stage-0/default-step-0-0: [20/501] Compiling C object 'libpurple/libpurple@@purple@sha/conversationtypes.c.o'.
24-Jan-2019 05:57:15 2019-01-24 00:57:15.957 default/stage-0/default-step-0-0: FAILED: libpurple/libpurple@@purple@sha/conversationtypes.c.o
24-Jan-2019 05:57:15 2019-01-24 00:57:15.957 default/stage-0/default-step-0-0: cc -Ilibpurple/libpurple@@purple@sha -Ilibpurple -I../libpurple -I. -I../ -I/usr/include/glib-2.0 -I/usr/lib/x86_64-linux-gnu/glib-2.0/include -I/usr/include/gplugin-1.0 -I/usr/include/libxml2 -I/usr/include/farstream-0.2 -I/usr/include/gstreamer-1.0 -I/usr/include/orc-0.4 -I/usr/include/json-glib-1.0 -fdiagnostics-color=always -pipe -D_FILE_OFFSET_BITS=64 -Wall -Winvalid-pch -O0 -g -DHAVE_CONFIG_H=1 -DPURPLE_DISABLE_DEPRECATED -DPIDGIN_DISABLE_DEPRECATED -DFINCH_DISABLE_DEPRECATED -DGNT_DISABLE_DEPRECATED -Waggregate-return -Wcast-align -Wdeclaration-after-statement -Wendif-labels -Werror-implicit-function-declaration -Wformat -Wformat-security -Winit-self -Wmissing-declarations -Wmissing-noreturn -Wmissing-prototypes -Wpointer-arith -Wfloat-equal -Wundef -fPIC -pthread  -MD -MQ 'libpurple/libpurple@@purple@sha/conversationtypes.c.o' -MF 'libpurple/libpurple@@purple@sha/conversationtypes.c.o.d' -o 'libpurple/libpurple@@purple@sha/conversationtypes.c.o' -c ../libpurple/conversationtypes.c
24-Jan-2019 05:57:15 2019-01-24 00:57:15.957 default/stage-0/default-step-0-0: In file included from ../libpurple/protocol.h:53,
24-Jan-2019 05:57:15 2019-01-24 00:57:15.957 default/stage-0/default-step-0-0:                  from ../libpurple/connection.h:207,
24-Jan-2019 05:57:15 2019-01-24 00:57:15.957 default/stage-0/default-step-0-0:                  from ../libpurple/account.h:53,
24-Jan-2019 05:57:15 2019-01-24 00:57:15.957 default/stage-0/default-step-0-0:                  from ../libpurple/accounts.h:32,
24-Jan-2019 05:57:15 2019-01-24 00:57:15.957 default/stage-0/default-step-0-0:                  from ../libpurple/internal.h:158,
24-Jan-2019 05:57:15 2019-01-24 00:57:15.957 default/stage-0/default-step-0-0:                  from ../libpurple/conversationtypes.c:22:
24-Jan-2019 05:57:15 2019-01-24 00:57:15.957 default/stage-0/default-step-0-0: ../libpurple/plugins.h:54:9: error: unknown type name ?GPluginPluginInterface?
24-Jan-2019 05:57:15 2019-01-24 00:57:15.957 default/stage-0/default-step-0-0: typedef GPluginPluginInterface PurplePluginInterface;
24-Jan-2019 05:57:15 2019-01-24 00:57:15.957 default/stage-0/default-step-0-0:          ^~~~~~~~~~~~~~~~~~~~~~
24-Jan-2019 05:57:15 2019-01-24 00:57:15.966 default/stage-0/default-step-0-0: [21/501] Compiling C object 'libpurple/libpurple@@purple@sha/contact.c.o'.
24-Jan-2019 05:57:15 2019-01-24 00:57:15.966 default/stage-0/default-step-0-0: FAILED: libpurple/libpurple@@purple@sha/contact.c.o
24-Jan-2019 05:57:15 2019-01-24 00:57:15.966 default/stage-0/default-step-0-0: cc -Ilibpurple/libpurple@@purple@sha -Ilibpurple -I../libpurple -I. -I../ -I/usr/include/glib-2.0 -I/usr/lib/x86_64-linux-gnu/glib-2.0/include -I/usr/include/gplugin-1.0 -I/usr/include/libxml2 -I/usr/include/farstream-0.2 -I/usr/include/gstreamer-1.0 -I/usr/include/orc-0.4 -I/usr/include/json-glib-1.0 -fdiagnostics-color=always -pipe -D_FILE_OFFSET_BITS=64 -Wall -Winvalid-pch -O0 -g -DHAVE_CONFIG_H=1 -DPURPLE_DISABLE_DEPRECATED -DPIDGIN_DISABLE_DEPRECATED -DFINCH_DISABLE_DEPRECATED -DGNT_DISABLE_DEPRECATED -Waggregate-return -Wcast-align -Wdeclaration-after-statement -Wendif-labels -Werror-implicit-function-declaration -Wformat -Wformat-security -Winit-self -Wmissing-declarations -Wmissing-noreturn -Wmissing-prototypes -Wpointer-arith -Wfloat-equal -Wundef -fPIC -pthread  -MD -MQ 'libpurple/libpurple@@purple@sha/contact.c.o' -MF 'libpurple/libpurple@@purple@sha/contact.c.o.d' -o 'libpurple/libpurple@@purple@sha/contact.c.o' -c ../libpurple/contact.c
24-Jan-2019 05:57:15 2019-01-24 00:57:15.966 default/stage-0/default-step-0-0: In file included from ../libpurple/protocol.h:53,
24-Jan-2019 05:57:15 2019-01-24 00:57:15.966 default/stage-0/default-step-0-0:                  from ../libpurple/connection.h:207,
24-Jan-2019 05:57:15 2019-01-24 00:57:15.966 default/stage-0/default-step-0-0:                  from ../libpurple/account.h:53,
24-Jan-2019 05:57:15 2019-01-24 00:57:15.966 default/stage-0/default-step-0-0:                  from ../libpurple/group.h:43,
24-Jan-2019 05:57:15 2019-01-24 00:57:15.966 default/stage-0/default-step-0-0:                  from ../libpurple/contact.h:42,
24-Jan-2019 05:57:15 2019-01-24 00:57:15.966 default/stage-0/default-step-0-0:                  from ../libpurple/contact.c:24:
24-Jan-2019 05:57:15 2019-01-24 00:57:15.966 default/stage-0/default-step-0-0: ../libpurple/plugins.h:54:9: error: unknown type name ?GPluginPluginInterface?
24-Jan-2019 05:57:15 2019-01-24 00:57:15.966 default/stage-0/default-step-0-0: typedef GPluginPluginInterface PurplePluginInterface;
24-Jan-2019 05:57:15 2019-01-24 00:57:15.966 default/stage-0/default-step-0-0:          ^~~~~~~~~~~~~~~~~~~~~~
24-Jan-2019 05:57:16 2019-01-24 00:57:16.365 default/stage-0/default-step-0-0: [22/501] Generating enums.c with a meson_exe.py custom command.
24-Jan-2019 05:57:19 2019-01-24 00:57:19.406 default/stage-0/default-step-0-0: [23/501] Generating im.pidgin.Pidgin.desktop_merge with a custom command.
24-Jan-2019 05:57:19 2019-01-24 00:57:19.451 default/stage-0/default-step-0-0: [24/501] Generating im.pidgin.Pidgin.appdata.xml_merge with a custom command.
24-Jan-2019 05:57:19 2019-01-24 00:57:19.451 default/stage-0/default-step-0-0: ninja: build stopped: subcommand failed.
24-Jan-2019 05:57:20 2019-01-24 00:57:20.610 default/stage-0/default-step-0-0: failed, exit status 1
24-Jan-2019 05:57:20 2019-01-24 00:57:20.610 default/stage-0: stage failed
24-Jan-2019 05:57:20 2019-01-24 00:57:20.610 default: removing workspace e5b3d926-1f2a-4cd7-a8e9-d313fd1de103
24-Jan-2019 05:57:21 2019-01-24 00:57:21.167 remove workspace: e5b3d926-1f2a-4cd7-a8e9-d313fd1de103
24-Jan-2019 05:57:21 2019-01-24 00:57:21.171 default: removed workspace e5b3d926-1f2a-4cd7-a8e9-d313fd1de103
24-Jan-2019 05:57:21 2019-01-24 00:57:21.171 default: removing network b0e790d8-a321-40c0-b729-e2fecabda44c
24-Jan-2019 05:57:21 2019-01-24 00:57:21.838 remove network: b0e790d8-a321-40c0-b729-e2fecabda44c
24-Jan-2019 05:57:21 2019-01-24 00:57:21.842 default: removed network b0e790d8-a321-40c0-b729-e2fecabda44c
24-Jan-2019 05:57:21 2019-01-24 00:57:21.842 convey-runner: exit status 1
24-Jan-2019 05:57:21 Failing task since return code of [/opt/atlassian/bamboo/agent-home/temp/PGN-MAIK-JOB1-233-ScriptBuildTask-9119326056014057855.sh] was 1 while expected 0
24-Jan-2019 05:57:21 Finished task 'Run bitbucket pipelines' with result: Failed
24-Jan-2019 05:57:21 Running post build plugin 'Docker Container Cleanup'
24-Jan-2019 05:57:21 Running post build plugin 'NCover Results Collector'
24-Jan-2019 05:57:21 Running post build plugin 'Clover Results Collector'
24-Jan-2019 05:57:21 Running post build plugin 'npm Cache Cleanup'
24-Jan-2019 05:57:21 Running post build plugin 'Artifact Copier'
24-Jan-2019 05:57:21 Finalising the build...
24-Jan-2019 05:57:21 Stopping timer.
24-Jan-2019 05:57:21 Build PGN-MAIK-JOB1-233 completed.
24-Jan-2019 05:57:22 Running on server: post build plugin 'NCover Results Collector'
24-Jan-2019 05:57:22 Running on server: post build plugin 'Build Hanging Detection Configuration'
24-Jan-2019 05:57:22 Running on server: post build plugin 'Clover Delta Calculator'
24-Jan-2019 05:57:22 Running on server: post build plugin 'Maven Dependencies Postprocessor'
24-Jan-2019 05:57:22 All post build plugins have finished
24-Jan-2019 05:57:22 Generating build results summary...
24-Jan-2019 05:57:22 Saving build results to disk...
24-Jan-2019 05:57:22 Logging substituted variables...
24-Jan-2019 05:57:22 Indexing build results...
24-Jan-2019 05:57:22 Finished building PGN-MAIK-JOB1-233.